{"text_format":"1","workbook":"xlsx","n_sheets":12,"sheets":["Project Input","CMP Project Input","Insert PDF map here","Instructions","Flowchart","Ref1","Ref2","Ref3","Ref4","Ref5","Ref6","Ref7"],"not_rendered":{"charts":0,"images":1,"macros":1,"external_links":0,"defined_names":1,"comments":0,"pivot_tables":0},"unopened":[],"bounds":{"document_bytes":16777216,"sheet_cells":100000,"rows_first":2000,"rows_last":500,"rows_between":2000,"halvings":0,"cell_chars":16384,"cell_head_chars":4096},"cells_cut":0,"cells_raw":0,"read":"whole","date_system":"1900"}

{"sheet":"Project Input","index":0,"n_rows":134,"n_cols":5,"rows_kept":134,"cut":false,"hidden":true,"merged":[[129,2,129,4],[0,0,2,4],[0,5,2,5],[115,1,117,4],[79,1,79,2],[80,2,80,4],[85,1,85,2],[84,1,84,2],[83,1,83,2],[113,1,113,4],[72,2,72,3],[69,1,69,4],[53,1,53,3],[45,2,45,3],[41,1,41,2],[41,3,41,4],[38,1,38,2],[38,3,38,4],[39,1,39,2],[39,3,39,4],[40,1,40,2],[40,3,40,4],[35,1,35,2],[37,1,37,4],[11,1,11,2],[13,1,13,2],[15,1,15,2],[17,1,17,2],[19,1,19,2],[23,1,26,4],[30,1,30,2],[31,1,31,2],[32,1,32,2],[33,1,33,2],[29,1,29,3],[34,1,34,2],[123,1,125,4],[70,1,70,4],[46,4,46,6],[44,4,44,6],[48,4,48,6],[47,4,47,6],[53,4,53,5],[49,2,49,3],[64,1,64,2],[62,1,62,2],[120,1,120,2],[47,2,47,3],[48,2,48,3],[43,1,44,3],[46,2,46,3]]}
["2021 Congestion Management Process Project Form"]
[]
[]
[]
[null,"Submitter Name","Agency Name","Date"]
[]
[null,"Email","Phone Number"]
[]
[]
[]
[null,"City"]
[]
[null,"Project Name"]
[]
[null,"Facility Name"]
[]
[null,"Project Limits (From)"]
[]
[null,"Project Limits (To)"]
[]
[null,"Does project add roadway capacity?"]
[null,null,{"$f":"IF(B22=\"No\", \"CMP form not required\", \"\")","v":""}]
[null,"Project Description (Including TSM&O and TDM Strategies)"]
[]
[]
[]
[]
[]
[]
[null,"Complementary TDM and TSM&O Projects in TIP (2020-2025)",null,null," Link to TIPINS Database"]
[null,"Project Name",null,"TIP Code","CSJ #"]
[]
[]
[]
[]
[]
[]
[null,"Other Complementary Projects not in TIP"]
[null,"Project Name",null,"Implementing Agency"]
[]
[]
[]
[]
[null,"Are the project limits within a current Metropolitan Transportation Plan Corridor?"]
[null,null,null,null,"MTP Webpage"]
[null,null,"MTP Reference #"]
[null,null,null,null,"Roadway Reccomentdations Listing"]
[]
[null,null,null,null,"Non-Regionally Significant Arterials"]
[]
[]
[]
[]
[null,"Was the segment evaluated in the 2021 CMP Update?",null,null,"Link to CMP Corridor Fact Sheets"]
[]
[null,"CMP Segment Number","CMP Segment Facility","Facility Limit (From)","Facility Limit (To)"]
[null,null,{"$f":"IFERROR(VLOOKUP(B57,'Ref6'!B3:E128,2,FALSE),\"\")","v":""},{"$f":"IFERROR(VLOOKUP(B57, 'Ref6'!B3:E128, 3, FALSE), \"\")","v":""},{"$f":"IFERROR(VLOOKUP(B57, 'Ref6'!B3:E128, 4, FALSE), \"\")","v":""}]
[]
[null,"Functional Class"]
[null,"Number","Description"]
[null,null,{"$f":"IFERROR(VLOOKUP(B61, 'Ref3'!E2:F8,2, FALSE), \"\")","v":""}]
[null,"Area Type"]
[]
[null,"Divided/Undivided"]
[]
[null,"Number of Lanes"]
[null,"Current","Proposed"]
[]
[null,"Next Step:"]
[null,{"$f":"IF(B22=\"No\",\" CMP Form Not Required\",IF(B22=\"Yes\",IF(B61<2.5,\"Consult CMP Fact Sheets for more information\",\"Continue to Corridor Evaluation\"),IF(C75=\"Arterial\",\"Provide segment map in next tab and submit to NCTCOG for arterial evaluation\",\"\")))","v":""}]
[null,{"$f":"IF(B70=\"Provide segment map in next tab and submit to NCTCOG for arterial evaluation\", \"Navigate to bottom to submit\", \"\")","v":""}]
[]
[null,null,"CMP Corridor Evaluation Sheet"]
[null,null," "]
[null,"Facility Type:",{"$f":"IF(B68=0,\"New Roadway\",IF(B55=\"Yes\",\"CMP Segment\",IF(B61<2.5,\"Non-CMP Segment Limited Access\",\"Arterial\")))","v":"New Roadway"},{"$f":"IF(C75=\"CMP Segment\", B57, \"\")","v":""}]
[]
[null,"Performance Measures:"]
[null,"Crash Rate",{"$f":"IF($C$75=\"CMP Segment\",VLOOKUP($D$75,'Ref6'!$B:$AM,10,FALSE),'Ref1'!D4)","v":0.5},"Travel Time Reliability",{"$f":"IF($C$75=\"CMP Segment\",VLOOKUP($D$75,'Ref6'!$B:$AM,12,FALSE),'Ref1'!D6)","v":0.5}]
[null,"Travel Time Index",{"$f":"IF($C$75=\"CMP Segment\",VLOOKUP($D$75,'Ref6'!$B:$AM,11,FALSE),'Ref1'!D5)","v":1},"Bridge/Pavement Condition",{"$f":"IF($C$75=\"CMP Segment\",VLOOKUP($D$75,'Ref6'!$B:$AM,13,FALSE),\"\")","v":""}]
[null,"Performance Measure Deficiencies?",null,{"$f":"SUM(C78:C79,E78:E79)","v":2}]
[null,"Eligibility",{"$f":"IF(D80=\"\",\"\",IF(D80=0,\"Corridor is not eligible for Congestion Management consideration\",\"Corridor is eligible, continue to asset evaluation and strategy selection\"))","v":"Corridor is eligible, continue to asset evaluation and strategy selection"}]
[null,null,null,{"$f":"IF(B70=\"Consult\", \"CMP Link\",\"\")","v":""}]
[null,"Asset Category Scores"]
[null,"Roadway Infrastructure",null,{"$f":"IF($C$75=\"CMP Segment\",VLOOKUP($D$75,'Ref6'!$B:$AM,36,FALSE),'Ref1'!B27)","v":"High"}]
[null,"Modal Options",null,{"$f":"IF($C$75=\"CMP Segment\",VLOOKUP($D$75,'Ref6'!$B:$AM,37,FALSE),'Ref1'!B28)","v":"Medium"}]
[null,"Roadway Operations",null,{"$f":"IF($C$75=\"CMP Segment\",VLOOKUP($D$75,'Ref6'!B:AM,38,FALSE),'Ref1'!B29)","v":"Low"}]
[]
[null,"Potential CMP Strategy Matches"]
[null,{"$f":"IF(C75=\"New Roadway\", \"\", IF(C75=\"arterial\",_xlfn._xlws.FILTER(Table1[Strategy],Table1[Column1]=1),IF(C75=\"CMP Segment\",_xlfn._xlws.FILTER(Table2[CMP20192], INDEX(Table2[[3.1]:[28.10]], 0, (MATCH('Project Input'!D75, 'Ref5'!7:7, 0)))=1))))","v":""}]
[]
[]
[]
[]
[]
[]
[]
[]
[]
[]
[]
[]
[]
[]
[]
[]
[]
[]
[]
[]
[]
[]
[]
[null,"Specify deficiency-correcting congestion mitigation strategy that will be implemented as part of the project."]
[null,"Strategies can be selected from above or from Appendix C of the 2021 Congestion Management Process."]
[null,"Link to Appendix C"]
[]
[]
[]
[]
[null,"If not implementing a congestion mitigation strategy, please select an exemption category from dropdown list."]
[]
[]
[null,"Please provide a description of reason for exemption below."]
[]
[]
[]
[]
[]
[null,null,null,"Form Status (Select one from option)"]
[]
[]
[]
[0]
[0]

{"sheet":"CMP Project Input","index":1,"n_rows":121,"n_cols":5,"rows_kept":121,"cut":false,"hidden":false,"merged":[[34,1,34,2],[0,5,2,5],[11,1,11,2],[13,1,13,2],[15,1,15,2],[17,1,17,2],[1,0,3,4],[19,1,19,2],[23,1,26,4],[31,1,31,3],[32,1,32,2],[33,1,33,2],[28,1,28,2],[29,1,29,2],[35,1,35,2],[36,1,36,2],[37,1,37,2],[39,1,39,4],[40,1,40,2],[40,3,40,4],[49,2,49,3],[49,4,49,6],[41,1,41,2],[41,3,41,4],[42,1,42,2],[42,3,42,4],[43,1,43,2],[43,3,43,4],[45,1,46,3],[46,4,46,6],[47,2,47,3],[48,2,48,3],[48,4,48,6],[50,4,50,6],[51,2,51,3],[55,1,55,3],[55,4,55,5],[64,1,64,2],[62,2,62,3],[110,1,112,4],[116,2,116,4],[7,1,7,2],[85,1,85,2],[86,1,86,2],[87,1,87,2],[100,1,100,4],[102,1,104,4],[107,1,107,2],[66,1,66,2],[71,1,71,4],[72,1,72,4],[74,2,74,3],[81,1,81,2],[82,2,82,4],[50,2,50,3]]}
[null,"Fill in orange fields ONLY"]
["2022 Congestion Management Process Project Form"]
[]
[]
[null,"Submitter Name","Agency Name","Date"]
[]
[null,"Email",null,"Phone Number"]
[]
[]
[]
[null,"City"]
[]
[null,"Project Name"]
[]
[null,"Facility Name"]
[]
[null,"Project Limits (From)"]
[]
[null,"Project Limits (To)"]
[]
[null,"Does project add roadway capacity?"]
[null,"Click to Select",{"$f":"IF(B22=\"No\", \"CMP form not required\", \"\")","v":""}]
[null,"Project Description (Including TSM&O and TDM Strategies)"]
[]
[]
[]
[]
[]
[null,"Is Project in TIP Database or TIP Related"]
[]
[]
[null,"Complementary TDM and TSM&O Projects in TIP (2020-2025)",null,null," Link to TIPINS Database"]
[null,"Project Name",null,"TIP Code","CSJ #"]
[]
[]
[]
[]
[]
[]
[null,"Other Complementary Projects not in TIP"]
[null,"Project Name",null,"Implementing Agency"]
[]
[]
[]
[]
[null,"Are the project limits within a current Metropolitan Transportation Plan Corridor?"]
[null,null,null,null,"MTP Webpage"]
[null,"Click to Select","MTP Reference #"]
[null,null,null,null,"Roadway Recommendations Listing"]
[]
[null,null,null,null,"Non-Regionally Significant Arterials"]
[]
[]
[]
[]
[null,"Was the segment evaluated in the 2021 CMP Update?",null,null,"Link to CMP Corridor Fact Sheets"]
[null,"Click to Select"]
[null,"CMP Segment Number","CMP Segment Facility","Facility Limit (From)","Facility Limit (To)"]
[null,null,{"$f":"IFERROR(VLOOKUP(B59,'Ref6'!B3:E128,2,FALSE),\"\")","v":""},{"$f":"IFERROR(VLOOKUP(B59, 'Ref6'!B3:E128, 3, FALSE), \"\")","v":""},{"$f":"IFERROR(VLOOKUP(B59, 'Ref6'!B3:E128, 4, FALSE), \"\")","v":""}]
[]
[null,"Functional Class"]
[null,"Number","Description"]
[null,"Click to Select",{"$f":"IFERROR(VLOOKUP(B63, 'Ref3'!E2:F8,2, FALSE), \"\")","v":0}]
[null,"Area Type"]
[null,"Click to Select"]
[null,"Divided/Undivided"]
[null,"Click to Select"]
[null,"Number of Lanes"]
[null,"Enter Current","Enter Proposed"]
[]
[null,"Next Step:"]
[null,{"$f":"IF(B22=\"No\",\" CMP Form Not Required\",IF(B22=\"Yes\",IF(B63<2.5,\"Consult CMP Fact Sheets for more information\",\"Continue to Corridor Evaluation\"),IF(C77=\"Arterial\",\"Provide segment map in next tab and submit to NCTCOG for arterial evaluation\",\"\")))","v":""}]
[null,{"$f":"IF(B72=\"Provide segment map in next tab and submit to NCTCOG for arterial evaluation\", \"Navigate to bottom to submit\", \"\")","v":""}]
[]
[null,null,"CMP Corridor Evaluation Sheet"]
[null,null," "]
[null,"Facility Type:",{"$f":"IF(B70=0,\"New Roadway\",IF(B57=\"Yes\",\"CMP Segment\",IF(B63<2.5,\"Non-CMP Segment Limited Access\",\"Arterial\")))","v":"New Roadway"},{"$f":"IF(C77=\"CMP Segment\", B59, \"\")","v":""}]
[]
[null,"Performance Measures:"]
[null,"Crash Rate",{"$f":"IF($C$77=\"CMP Segment\",VLOOKUP($D$77,'Ref6'!$B:$AM,10,FALSE),'Ref1'!D4)","v":0.5},"Travel Time Reliability",{"$f":"IF($C$77=\"CMP Segment\",VLOOKUP($D$77,'Ref6'!$B:$AM,12,FALSE),'Ref1'!D6)","v":0.5}]
[null,"Travel Time Index",{"$f":"IF($C$77=\"CMP Segment\",VLOOKUP($D$77,'Ref6'!$B:$AM,11,FALSE),'Ref1'!D5)","v":1},"Bridge/Pavement Condition",{"$f":"IF($C$77=\"CMP Segment\",VLOOKUP($D$77,'Ref6'!$B:$AM,13,FALSE),\"\")","v":""}]
[null,"Performance Measure Deficiencies?",null,{"$f":"SUM(C80:C81,E80:E81)","v":2}]
[null,"Eligibility",{"$f":"IF(D82=\"\",\"\",IF(D82=0,\"Corridor is not eligible for Congestion Management consideration\",\"Corridor is eligible, continue to asset evaluation and strategy selection\"))","v":"Corridor is eligible, continue to asset evaluation and strategy selection"}]
[null,null,null,{"$f":"IF(B72=\"Consult\", \"CMP Link\",\"\")","v":""}]
[null,"Asset Category Scores"]
[null,"Roadway Infrastructure",null,{"$f":"IF($C$77=\"CMP Segment\",VLOOKUP($D$77,'Ref6'!$B:$AM,36,FALSE),'Ref1'!B27)","v":"High"}]
[null,"Modal Options",null,{"$f":"IF($C$77=\"CMP Segment\",VLOOKUP($D$77,'Ref6'!$B:$AM,37,FALSE),'Ref1'!B28)","v":"Medium"}]
[null,"Roadway Operations",null,{"$f":"IF($C$77=\"CMP Segment\",VLOOKUP($D$77,'Ref6'!B:AM,38,FALSE),'Ref1'!B29)","v":"Low"}]
[]
[null,"Potential CMP Strategy Matches"]
[null,{"$f":"IF(C77=\"New Roadway\", \"\", IF(C77=\"arterial\",_xlfn._xlws.FILTER(Table1[Strategy],Table1[Column1]=1),IF(C77=\"CMP Segment\",_xlfn._xlws.FILTER(Table2[CMP20192], INDEX(Table2[[3.1]:[28.10]], 0, (MATCH('Project Input'!D75, 'Ref5'!7:7, 0)))=1))))","v":""}]
[]
[]
[]
[]
[null,null," "]
[]
[]
[]
[null,"Specify deficiency-correcting congestion mitigation strategy that will be implemented as part of the project."]
[null,"Strategies can be selected from above or from Appendix C of the 2021 Congestion Management Process."]
[null,"Link to Appendix C"]
[]
[]
[]
[]
[null,"If not implementing a congestion mitigation strategy, please select an exemption category from dropdown list."]
[null,"Click to Select"]
[]
[null,"Please provide a description of reason for exemption below."]
[]
[]
[]
[]
[]
[null,null,null,"Form Status (Select one from option)"]
[null,null,"Click to Select"]
[]
[]
[0]
[0]

{"sheet":"Insert PDF map here","index":2,"n_rows":1,"n_cols":1,"rows_kept":1,"cut":false,"hidden":false,"merged":[[0,0,0,2]]}
["Insert PDF Map here:"]

{"sheet":"Instructions","index":3,"n_rows":123,"n_cols":6,"rows_kept":123,"cut":false,"hidden":false,"merged":[[79,5,87,7],[112,5,125,7],[50,5,50,7],[51,5,51,7],[52,5,52,7],[4,5,6,7],[21,5,22,7],[31,5,33,7],[38,5,41,7],[45,4,49,7],[44,5,44,7],[42,5,42,7],[43,5,43,7],[34,5,34,7],[35,5,35,7],[36,5,36,7],[37,5,37,7],[26,5,26,7],[27,5,27,7],[28,5,28,7],[29,5,29,7],[30,5,30,7],[20,5,20,7],[23,5,23,7],[24,5,24,7],[25,5,25,7],[14,5,14,7],[15,5,15,7],[16,5,16,7],[17,5,17,7],[18,5,18,7],[19,5,19,7],[115,1,117,4],[120,1,120,2],[123,1,125,4],[7,5,7,7],[8,5,8,7],[9,5,9,7],[79,1,79,2],[80,2,80,4],[83,1,83,2],[84,1,84,2],[85,1,85,2],[113,1,113,4],[53,1,53,3],[53,4,53,5],[62,1,62,2],[64,1,64,2],[69,1,69,4],[72,2,72,3],[58,3,68,6],[71,4,75,6],[49,2,49,3],[39,1,39,2],[39,3,39,4],[40,1,40,2],[40,3,40,4],[41,1,41,2],[41,3,41,4],[44,1,44,3],[45,2,45,3],[46,2,46,3],[47,2,47,3],[48,2,48,3],[33,1,33,2],[34,1,34,2],[35,1,35,2],[37,1,37,4],[38,1,38,2],[38,3,38,4],[32,1,32,2],[0,0,2,4],[0,5,2,5],[11,1,11,2],[13,1,13,2],[15,1,15,2],[17,1,17,2],[10,5,10,7],[11,5,11,7],[12,5,12,7],[13,5,13,7],[19,1,19,2],[23,1,26,4],[29,1,29,3],[30,1,30,2],[31,1,31,2]]}
["2022 Congestion Management Process Project Form"]
[]
[]
[]
[null,"Submitter Name","Agency Name","Date",null,"Fields filled in orange denote fields which require input from submitting agency"]
[]
[null,"Email","Phone Number"]
[]
[]
[]
[null,"City"]
[]
[null,"Project Name"]
[]
[null,"Facility Name"]
[]
[null,"Project Limits (From)"]
[]
[null,"Project Limits (To)"]
[]
[null,"Does project add roadway capacity?"]
[null,null,{"$f":"IF(B22=\"No\", \"CMP form not required\", \"\")","v":""},null,null,"Form is not required if the project does not add roadway capacity"]
[null,"Project Description (Including TSM&O and TDM Strategies)"]
[]
[]
[]
[]
[]
[]
[null,"Complementary TDM and TSM&O Projects in TIP",null,null," Link to TIPINS Database"]
[null,"Project Name",null,"TIP Code","CSJ #"]
[null,null,null,null,null,"This section is for projects listed in the TIP, projects can be found in TIPINS database linked above"]
[]
[]
[]
[]
[]
[null,"Other Complementary Projects not in TIP"]
[null,"Project Name",null,"Implementing Agency",null,"This section can be used for any other projects along the corridor which may be complementary"]
[]
[]
[]
[]
[]
[null,"Are the project limits within a current Metropolitan Transportation Plan Corridor?",null,null,"MTP Corridors Link"]
[null,null,"MTP Reference #",null,"After clicking through the link, find project listings under \"Other Resources.\" Projects will likely be listed under the Roadway Recommendations Listings or the Non-Regionally Significant Arterials"]
[]
[]
[]
[]
[]
[]
[]
[null,"Was the segment evaluated in the 2021 CMP Update?",null,null,"Link to CMP Corridor Fact Sheets"]
[]
[null,"CMP Segment Number","CMP Segment Facility","Facility Limit (From)","Facility Limit (To)"]
[null,null,{"$f":"IFERROR(VLOOKUP(B57,'Ref6'!B3:E128,2,FALSE),\"\")","v":""},{"$f":"IFERROR(VLOOKUP(B57, 'Ref6'!B3:E128, 3, FALSE), \"\")","v":""},{"$f":"IFERROR(VLOOKUP(B57, 'Ref6'!B3:E128, 4, FALSE), \"\")","v":""}]
[]
[null,"Functional Class",null,"This section determines which set of criteria is used to evaluate need for Congestion Management Strategies. CMP segments will be located on limited access facilities throughout the region. If the submitted segment is a CMP segment, the corridor has already been evaluated under criteria for limited access corridors, if not, continue to fill out the remaining fields."]
[null,"Number","Description"]
[null,null,{"$f":"VLOOKUP(B61, 'Ref3'!E2:F8,2, FALSE)","v":{"$error":"#N/A"}}]
[null,"Area Type"]
[]
[null,"Divided/Undivided"]
[]
[null,"Number of Lanes"]
[null,"Enter Current","Enter Proposed"]
[]
[null,"Next Step:"]
[null,{"$f":"IF(B22=\"No\",\" CMP Form Not Required\",IF(B22=\"Yes\",IF(B61<2.5,\"Consult CMP Fact Sheets for more information\",\"Continue to Corridor Evaluation\"),IF(C75=\"Arterial\",\"Provide segment map in next tab and submit to NCTCOG for arterial evaluation\",\"\")))","v":""}]
[]
[null,null,null,null,"**If the segment is a CMP corridor, the fields below will automatically fill and you can continue to the final section. If the section is not a CMP segment, submit to NCTCOG for corridor evaluation."]
[null,null,"CMP Corridor Evaluation Sheet"]
[null,null," "]
[null,"Facility Type:",{"$f":"IF(B68=0,\"New Roadway\",IF(B55=\"Yes\",\"CMP Segment\",IF(B61<2.5,\"Non-CMP Segment Limited Access\",\"Arterial\")))","v":"New Roadway"},{"$f":"IF(C75=\"CMP Segment\", B57, \"\")","v":""}]
[]
[null,"Performance Measures:"]
[null,"Crash Rate",{"$f":"IF($C$75=\"CMP Segment\",VLOOKUP($D$75,'Ref6'!$B:$AM,10,FALSE),'Ref1'!D4)","v":0.5},"Travel Time Reliability",{"$f":"IF($C$75=\"CMP Segment\",VLOOKUP($D$75,'Ref6'!$B:$AM,12,FALSE),'Ref1'!D6)","v":0.5}]
[null,"Travel Time Index",{"$f":"IF($C$75=\"CMP Segment\",VLOOKUP($D$75,'Ref6'!$B:$AM,11,FALSE),'Ref1'!D5)","v":1},"Bridge/Pavement Condition",{"$f":"IF($C$75=\"CMP Segment\",VLOOKUP($D$75,'Ref6'!$B:$AM,13,FALSE),\"\")","v":""}]
[null,"Performance Measure Deficiencies?",null,{"$f":"SUM(C78:C79,E78:E79)","v":2},null,"This section will either be automatically completed or filled in by NCTCOG. Once the information is completed, this provides the information to fill out the following section including suggested CMP strategies"]
[null,"Eligibility",{"$f":"IF(D80=\"\",\"\",IF(D80=0,\"Corridor is not eligible for Congestion Management consideration\",\"Corridor is eligible, continue to asset evaluation and strategy selection\"))","v":"Corridor is eligible, continue to asset evaluation and strategy selection"}]
[null,null,null,{"$f":"IF(B70=\"Consult\", \"CMP Link\",\"\")","v":""}]
[null,"Asset Category Scores"]
[null,"Roadway Infrastructure",null,{"$f":"IF($C$75=\"CMP Segment\",VLOOKUP($D$75,'Ref6'!$B:$AM,36,FALSE),'Ref1'!B27)","v":"High"}]
[null,"Modal Options",null,{"$f":"IF($C$75=\"CMP Segment\",VLOOKUP($D$75,'Ref6'!$B:$AM,37,FALSE),'Ref1'!B28)","v":"Medium"}]
[null,"Roadway Operations",null,{"$f":"IF($C$75=\"CMP Segment\",VLOOKUP($D$75,'Ref6'!B:AM,38,FALSE),'Ref1'!B29)","v":"Low"}]
[]
[null,"Potential CMP Strategy Matches"]
[null,{"$f":"IF(C75=\"New Roadway\", \"\", IF(C75=\"arterial\",_xlfn._xlws.FILTER(Table1[Strategy],Table1[Column1]=1),IF(C75=\"CMP Segment\",_xlfn._xlws.FILTER(Table2[CMP20192], INDEX(Table2[[3.1]:[28.10]], 0, (MATCH(Instructions!D75, 'Ref5'!7:7, 0)))=1))))","v":""}]
[]
[]
[]
[]
[]
[]
[]
[]
[]
[]
[]
[]
[]
[]
[]
[]
[]
[]
[]
[]
[]
[]
[]
[null,"Specify deficiency-correcting congestion mitigation strategy that will be implemented as part of the project.",null,null,null,"This section aims to allow space to explain the project and how it fits with Congestion Management Strategies. If no strategy is selected, please explain why. After this section is completed, submit to NCTCOG for review."]
[null,"Strategies can be selected from above or from Appendix C of the 2021 Congestion Management Process."]
[null,"Link to Appendix C"]
[]
[]
[]
[]
[null,"If not implementing a congestion mitigation strategy, please select an exemption category from dropdown list."]
[]
[]
[null,"Please provide a description of reason for exemption below."]

{"sheet":"Flowchart","index":4,"n_rows":28,"n_cols":7,"rows_kept":28,"cut":false,"hidden":false,"merged":[[27,4,30,6],[17,0,20,1],[12,4,15,6],[17,4,20,6],[22,0,25,1],[22,4,25,6],[0,3,3,4],[6,0,9,1],[6,3,9,4],[6,6,9,7],[12,0,15,1]]}
[null,null,null,"Complete Corridor Information"]
[]
[]
[]
[]
[]
["CMP Segment",null,null,"Non-CMP Limited Access or New Roadway",null,null,"Arterial"]
[]
[]
[]
[]
[]
["View information populated in form",null,null,null,"Submit form to NCTCOG for corridor analysis"]
[]
[]
[]
[]
["Complete bottom section, submit for review",null,null,null,"Receive completed corridor analysis"]
[]
[]
[]
[]
["NCTCOG form review",null,null,null,"Complete bottom section using information from corridor evaluation sheet, submit for review"]
[]
[]
[]
[]
[null,null,null,null,"NCTCOG form review"]

{"sheet":"Ref1","index":5,"n_rows":29,"n_cols":6,"rows_kept":29,"cut":false,"hidden":true,"merged":[]}
["Arterial Analysis"]
[null,"Input Value","Grade","Points","Max Category Points","Grade Number"]
["Performance Measures"]
["Crash Rate",75,{"$f":"IF(D4=E4, \"High\", IF(D4=E4/2, \"Medium\", \"Low\"))","v":"Medium"},{"$f":"IF(B4>80,E4, IF( B4>50,E4/2,0))","v":0.5},1,{"$f":"IF(C4=\"High\", 1, IF(C4=\"Medium\", 0.5, \"\"))","v":0.5}]
["Travel Time Index",95,{"$f":"IF(D5=E5, \"High\", IF(D5=E5/2, \"Medium\", \"Low\"))","v":"High"},{"$f":"IF(B5>80,E5, IF( B5>50,E5/2,0))","v":1},1,{"$f":"IF(C5=\"High\", 1, IF(C5=\"Medium\", 0.5, \"\"))","v":1}]
["Travel Time Reliability",75,"Medium",0.5,1,0.5]
[null,null,null,null,null,""]
["Roadway Infrastructure",null,null,null,null,""]
["Parallel Arterials",0,"Low",0,15,""]
["Parallel Freeway",95,"High",10,10,1]
["Bike/Ped Infrastructure",100,"High",15,15,1]
[null,null,null,null,null,""]
["Modal Options",null,null,null,null,""]
["Park and Ride",0,"Low",0,5,""]
["Light Rail",0,"Low",0,10,""]
["Commuter Rail",0,"Low",0,5,""]
["Bus Geometry",100,"High",10,10,1]
["Bus Density",100,"High",10,10,1]
[null,null,null,null,null,""]
["Operations",null,null,null,null,""]
["Shoulder",0,"Low",0,10,""]
["ITS",80,"Medium",7.5,15,0.5]
["Signal Retiming",0,"Low",0,15,""]
[]
[]
["Category Scores"]
["Roadway Infrastructure",{"$f":"IF(SUM(D9:D11)>24.5, \"High\", IF(SUM(D9:D11)>14.5, \"Medium\", \"Low\"))","v":"High"}]
["Modal Options",{"$f":"IF(SUM(D14:D18)>24.5, \"High\", IF(SUM(D14:D18)>14.5, \"Medium\", \"Low\"))","v":"Medium"}]
["Operations",{"$f":"IF(SUM(D21:D23)>24.5, \"High\", IF(SUM(D21:D23)>14.5, \"Medium\", \"Low\"))","v":"Low"}]

{"sheet":"Ref2","index":6,"n_rows":34,"n_cols":4,"rows_kept":34,"cut":false,"hidden":true,"merged":[]}
[null,null,"Limited Access","Arterials"]
[null,"Performance Measures"]
[null,"Crash Rate","Pass/Fail","Pass/Fail"]
[null,"Travel Time Index","Pass/Fail","Pass/Fail"]
[null,"Level of Travel Time Reliability","Pass/Fail","Pass/Fail"]
[null,"Pavement","Pass/Fail"]
[null,"Bridge","Pass/Fail"]
[null,"Outputs"]
[null,"Notes"]
[]
[null,"Roadway Infrastructure"]
[null,"Parallel Arterials",10,15]
[null,"Frontage Roads",10]
[null,"Parallel Freeway",20,10]
[null,"Bike/Ped Infrastructure",null,15]
[null,"Category Total Points",{"$f":"SUM(C12:C14)","v":40},{"$f":"SUM(D12:D15)","v":40}]
[null,"Notes"]
[]
[null,"Modal Options"]
[null,"Park and Rides",10,5]
[null,"Light Rail",10,10]
[null,"Commuter Rail",10,5]
[null,"Bus Geometry",5,10]
[null,"Bus Density",5,10]
[null,"Category Total Points",{"$f":"SUM(C20:C24)","v":40},{"$f":"SUM(D20:D24)","v":40}]
[null,"Notes"]
[]
[null,"Operations"]
[null,"Shoulder",7,10]
[null,"ITS",10,15]
[null,"HOV/Managed Lane",20]
[null,"Truck Lane",3]
[null,"Signal Retiming",null,15]
[null,"Category Total Points",{"$f":"SUM(C29:C32)","v":40},{"$f":"SUM(D29:D33)","v":40}]

{"sheet":"Ref3","index":7,"n_rows":9,"n_cols":11,"rows_kept":9,"cut":false,"hidden":true,"merged":[]}
["Functional Classification","Cities","Counties","Response","Functional Class","Functional Class Desc","AreaTypeNumber","AreaTypeDesc","Click to Select","Click to Select","Click to Select"]
["Interstate",null,null,"Click to Select","Click to Select",null,"Click to Select","Click to Select","Divided","Safety","Partially Complete"]
["Freeways and Expressways",null,null,"Yes",1,"Interstate",1,"Central Business District","Undivided","Bottleneck","Questions"]
["Other Principal Arterials",null,null,"No",2,"Other Freeways and Expressways",2,"Outer Business District",null,"Sustainable Development/Land Use","Information completed, ready for corridor analysis"]
["Minor Arterials",null,null,null,3,"Other Principal Arterial",3,"Urban Residential",null,"Managed Lanes","Complete, ready for NCTCOG review"]
["Major Collector",null,null,null,4,"Minor Arterial",4,"Suburban Residential"]
["Minor Collector",null,null,null,5,"Major Collector",5,"Rural"]
[null,null,null,null,6,"Minor Collector"]
[null,null,null,null,7,"Local"]

{"sheet":"Ref4","index":8,"n_rows":44,"n_cols":14,"rows_kept":44,"cut":false,"hidden":true,"merged":[]}
["Possible Points","Arterial Fit?","Column1","Strategy","Full","Half","Sum","Pct"]
[1.5,1,{"$f":"Table1[[#This Row],[Pct]]","v":0.33333333333333331},"Bike Share","O","V,W",{"$f":"N16+N33/2","v":0.5},{"$f":"G2/A2","v":0.33333333333333331},null,null,null,"A"]
[3,1,{"$f":"Table1[[#This Row],[Pct]]","v":0.33333333333333331},"Bike/Transit Integration","U,T,AF",null,{"$f":"N22+N21+N33","v":1},0.33333333333333331,null,null,null,"B"]
[1,1,{"$f":"Table1[[#This Row],[Pct]]","v":1},"SOV Trip Reduction Programming / Commuter Financial Incentives","ALL",null,1,1,null,null,null,"C"]
[3,1,{"$f":"Table1[[#This Row],[Pct]]","v":0.33333333333333331},"Park and Ride","T,U,V",null,{"$f":"N21+N22+N33","v":1},0.33333333333333331,null,null,null,"D"]
[1,0,{"$f":"Table1[[#This Row],[Pct]]","v":0},"Ridesharing and Ridematching- Carpool/Vanpool",null,"S,R,Z",{"$f":"(N20+N19+N27)/2","v":0},0,null,null,null,"E"]
[3.5,1,{"$f":"Table1[[#This Row],[Pct]]","v":0.2857142857142857},"Transit","T,U,V","s",{"$f":"SUM(N21:N23)+N20/2","v":1},0.2857142857142857,null,null,null,"F"]
[1,1,{"$f":"Table1[[#This Row],[Pct]]","v":0},"Freight RR Grade Crossing","o",null,{"$f":"N16","v":0},0,null,null,null,"G"]
[1,0,{"$f":"Table1[[#This Row],[Pct]]","v":0},"Truck Lane Restrictions","AK",null,null,0,null,null,null,"H"]
[1,1,{"$f":"Table1[[#This Row],[Pct]]","v":1},"Active Parking Mgmt","ALL",null,1,1,null,null,null,"I"]
[2,0,{"$f":"Table1[[#This Row],[Pct]]","v":0},"HOV/Managed Lane Management","Z,R,Y",null,null,0,null,null,null,"J"]
[4,0,{"$f":"Table1[[#This Row],[Pct]]","v":0},"Emergency Routing","O,P,Q,Y",null,null,0,null,null,null,"K"]
[1.5,0,{"$f":"Table1[[#This Row],[Pct]]","v":0},"Mobility Assistance Patrol / Courtesy Patrol","X,Y",null,null,0,null,null,null,"L"]
[3.5,0,{"$f":"Table1[[#This Row],[Pct]]","v":0},"Strategic Incident Response and Clearance Time Program","X,Y","O,P,Q",null,0,null,null,null,"M"]
[1,0,{"$f":"Table1[[#This Row],[Pct]]","v":0},"Traffic Incident Management Training","AI",null,null,0,null,null,null,"N"]
[2,0,{"$f":"Table1[[#This Row],[Pct]]","v":0},"Access Management Improvements (Turn Lanes, Close Driveways)","O,P",null,null,0,null,null,null,"O","AvailableArterialCapacity",{"$f":"SUMIF('Ref1'!F9,1)","v":0}]
[1,0,{"$f":"Table1[[#This Row],[Pct]]","v":0},"Bottleneck Removal","AO",null,null,0,null,null,null,"P","Frontage_Pct"]
[1.5,1,{"$f":"Table1[[#This Row],[Pct]]","v":0.66666666666666663},"Bus Loading Bays","AF,O",null,{"$f":"N33+N16/2","v":1},0.66666666666666663,null,null,null,"Q","ParallelFreeway_Pct",{"$f":"SUMIF('Ref1'!F10,1)","v":1}]
[1,1,{"$f":"Table1[[#This Row],[Pct]]","v":1},"Intersection Improvements","ALL",null,1,1,null,null,null,"R","HOV_Pct"]
[2.5,1,{"$f":"Table1[[#This Row],[Pct]]","v":0.2},"Bike/Ped Improvements","O","T,U,AF",{"$f":"N16+(SUM(N21,N22,N33)/2)","v":0.5},0.2,null,null,null,"S","ParkAndRides",{"$f":"SUMIF('Ref1'!F14,1)","v":0}]
[2.5,1,{"$f":"Table1[[#This Row],[Pct]]","v":0.2},"Bike Parking Facilities","O","T,U,AF",{"$f":"N16+(SUM(N21,N22,N33)/2)","v":0.5},0.2,null,null,null,"T","LightRail_Pct",{"$f":"SUMIF('Ref1'!F15,1)","v":0}]
[0,1,null,"Context Sensitive Design",null,null,null,{"$error":"#DIV/0!"},null,null,null,"U","CommuterRail_Pct",{"$f":"SUMIF('Ref1'!F16,1)","v":0}]
[0,1,null,"Location of Efficient Development",null,null,null,{"$error":"#DIV/0!"},null,null,null,"V","BusRoute_Pct",{"$f":"SUMIF('Ref1'!F17,1)/2+SUMIF('Ref1'!F18,1)/2","v":1}]
[1,1,{"$f":"Table1[[#This Row],[Pct]]","v":0},"Pedestrianized Streets","O",null,{"$f":"N16","v":0},0,null,null,null,"W","BusDensity"]
[3,1,{"$f":"Table1[[#This Row],[Pct]]","v":0.33333333333333331},"Transit Oriented Development","T,U,AF",null,{"$f":"N21+N22+N33","v":1},0.33333333333333331,null,null,null,"X","Shoulder",{"$f":"SUMIF('Ref1'!F21,1)","v":0}]
[2,0,{"$f":"Table1[[#This Row],[Pct]]","v":0},"Active Traffic Managemtent (Lane Assignment, Re-Striping, Turning Movement and lane use restrictions","O,P",null,null,0,null,null,null,"Y","ITS_Pct",{"$f":"SUMIF('Ref1'!F22,1)","v":0}]
[1,1,{"$f":"Table1[[#This Row],[Pct]]","v":0},"ITS Devices","AJ",null,{"$f":"N37","v":0},0,null,null,null,"Z","ManagedLane_Pct"]
[1,1,{"$f":"Table1[[#This Row],[Pct]]","v":1},"Probe Surveilance","ALL",null,1,1,null,null,null,"AA","TruckLaneRestriction_Pct"]
[4,0,{"$f":"Table1[[#This Row],[Pct]]","v":0},"Regional Traffic Control","O,P,Q,Y",null,null,0,null,null,null,"AB","FreightRoute_Pct"]
[0.5,0,{"$f":"Table1[[#This Row],[Pct]]","v":0},"Reversible Lane Management",null,"O",null,0,null,null,null,"AC","TIM_Pct"]
[1,1,{"$f":"Table1[[#This Row],[Pct]]","v":0},"Shoulder Utilization Program","X",null,{"$f":"N25","v":0},0,null,null,null,"AD","MAP_Pct"]
[2,1,{"$f":"Table1[[#This Row],[Pct]]","v":0},"Traffic Signal Improvements","O,P",null,{"$f":"N43","v":0},0,null,null,null,"AE","Shape_Length"]
[1,1,{"$f":"Table1[[#This Row],[Pct]]","v":1},"Speed Harmonization and Monitoring","ALL",null,1,1,null,null,null,"AF","BusCombo",{"$f":"SUMIF('Ref1'!F17,1)/2+SUMIF('Ref1'!F18,1)/2","v":1}]
[1,1,{"$f":"Table1[[#This Row],[Pct]]","v":0},"Demand Response Transit Operations","AL",null,{"$f":"COUNTIF(N33, 0)","v":0},0,null,null,null,"AG","MAP"]
[3,1,{"$f":"Table1[[#This Row],[Pct]]","v":0.33333333333333331},"Adaptive/Demand Responsive Signal Systems","AF,P,O",null,{"$f":"N33+N16","v":1},0.33333333333333331,null,null,null,"AH","TIM_Pct"]
[4,0,{"$f":"Table1[[#This Row],[Pct]]","v":0},"Transit Fixed-Route Operations","AF,P,O,R,Z",null,null,0,null,null,null,"AI","TIM_Low"]
[5,1,{"$f":"Table1[[#This Row],[Pct]]","v":0.2},"Transit Management","U,T,AF,R,Z,O",null,{"$f":"N22+N21+N33+N16","v":1},0.2,null,null,null,"AJ","ITS_Low",{"$f":"COUNTIF('Ref1'!F22, 0)","v":0}]
[1,1,{"$f":"Table1[[#This Row],[Pct]]","v":0},"Transit System Signal Priority","AF",null,{"$f":"COUNTIF(N33, 0)","v":0},0,null,null,null,"AK","TL_Low","SUMIF('Arterial Analysis'!F9,1)"]
[3,1,{"$f":"Table1[[#This Row],[Pct]]","v":0.33333333333333331},"Transit Vehicle Tracking","U,T,AF",null,{"$f":"N22+N21+N33","v":1},0.33333333333333331,null,null,null,"AL","BusLow","SUMIF('Arterial Analysis'!F9,1)"]
[1,1,{"$f":"Table1[[#This Row],[Pct]]","v":1},511,"ALL",null,1,1,null,null,null,"AM","TollFacility","SUMIF('Arterial Analysis'!F9,1)"]
[1,1,{"$f":"Table1[[#This Row],[Pct]]","v":1},"Integrated Transportation Management/Route Guidance","ALL",null,1,1,null,null,null,"AN","TollManaged","SUMIF('Arterial Analysis'!F9,1)"]
[1,0,{"$f":"Table1[[#This Row],[Pct]]","v":0},"Dynamic Pricing","AN",null,null,0,null,null,null,"AO","Bottleneck","SUMIF('Arterial Analysis'!F9,1)"]
[0,1,null,"Dynamic Routing","ALL",null,1,{"$error":"#DIV/0!"},null,null,null,null,"Signal Retiming",{"$f":"COUNTIF('Ref1'!F23,0)","v":0}]
[0,1,null,"Mobility as a service","ALL",null,1,{"$error":"#DIV/0!"}]

{"sheet":"Ref5","index":9,"n_rows":51,"n_cols":129,"rows_kept":51,"cut":false,"hidden":true,"merged":[]}
["OBJECTID","MAX","OBJECTID",1,2,3,4,5,6,7,8,9,10,11,12,13,14,15,16,17,18,19,20,21,22,23,24,25,26,27,28,29,30,31,32,33,34,35,36,37,38,39,40,41,42,43,44,45,46,47,48,49,50,51,52,53,54,55,56,57,58,59,60,61,62,63,64,65,66,67,68,69,70,71,72,73,74,75,76,77,78,79,80,81,82,83,84,85,86,87,88,89,90,91,92,93,94,95,96,97,98,99,100,101,102,103,104,105,106,107,108,109,110,111,112,113,114,115,116,117,118,119,120,121,122,123,124,125,126]
["CMP2019",null,"CMP2019","3.1","5.1","21.1","21.2","11.4","120.2","121.1","130.4","131.1","28.11","28.12","28.13","30.1","31.1","28.2","30.2","28.1","30.3","30.4","30.5","28.3","5.6","52.1","150.1","1.5","151.3","151.4","151.2","151.1","11.9","11.8","22.1","9.1","22.2","13.1","11.7","12.4","12.5","123.1","15.1","130.1","130.2","123.2","7.3","7.2","11.6","5.2","130.3","120.1","23.3","23.2","23.1","131.2","32.1","32.2","131.3","30.14","30.15","30.13","30.11","30.9","30.8","30.6","1.6","9.4","9.3","15.3","17.3","38.1","7.9","28.4","28.5","28.6","9.2","15.2","17.2","22.3","7.4","31.2","5.9","27.3","36.3","30.16","23.6","7.5","42.1","17.1","22.4","44.1","25.1","7.7","36.1","27.2","27.1","28.8","7.8","28.9","28.7","21.3","23.5","14.2","153.2","153.1","5.7","5.8","5.5","11.10","1.4","5.4","150.2","7.1","11.5","12.3","30.7","38.2","7.10","30.10","7.6","22.5","12.6","11.3","23.4","21.4","30.12","28.14","28.10"]
["Facility",null,"Facility","IH 35","IH 35W","DNT","DNT","SRT","PGBT (North)","PGBT (East)","IH 635 (North)","IH 635 (East)","IH 30","IH 30","IH 30","IH 20","CTP","IH 30","IH 20","IH 30","IH 20","IH 20","IH 20","IH 30","IH 35W","SS 280","IH 820 (North)","US 287","IH 820 (East)","IH 820 (East)","IH 820 (East)","IH 820 (East)","SH 121","SH 121","SH 183","SH 360","SH 183","International Parkway","SH 121","SH 114","SH 114","PGBT (West)","PGBT/SH 161","IH 635 (North)","IH 635 (North)","PGBT (West)","IH 35E","IH 35E","SH 121","IH 35W","IH 635 (North)","PGBT (North)","US 75","US 75","US 75","IH 635 (East)","US 80","US 80","IH 635 (East)","IH 20","IH 20","IH 20","IH 20","IH 20","IH 20","IH 20","US 287","SH 360 (Toll)","SH 360","PGBT (West)","SL 12","US 67","IH 35E","IH 30","IH 30","IH 30","SH 360","PGBT (West)","SL 12","SH 183","IH 35E","CTP ","IH 35W","IH 45","US 175","IH 20","US 75","IH 35E","SS 482","SL 12","SH 183","SS 366","IH 345","IH 35E","US 175","IH 45","IH 45","IH 30 \"Horseshoe\"","IH 35E","IH 30","IH 30","DNT ","US 75","SH 199","IH 820 (West)","IH 820 (West)","IH 35W","IH 35W","IH 35W","SH 121","US 287","IH 35W","IH 820 (North)","IH 35E","SH 121","SH 114","IH 20","US 67","IH 35E","IH 20","IH 35E","SH 183","SH 114","SRT","US 75","DNT","IH 20","IH 30","IH 30"]
["From_Facility",null,"From_Facility","Denton C/L","FM 917","S of US 380 (Freeway Lanes)","SRT","DNT","DNT","US 75","DNT","US 75","US 80","IH 635 (East)","PGBT","SS 312","IH 30","IH 820 (West)","IH 30","IH 20","IH 820 (West)","CTP","IH 35W","IH 35W","SH 121","IH 35W","SH 199","IH 35W","IH 30 ","US 287","SH 121","SH 183","SH 183","SH 360","SH 121","SH 121","SH 360","SH 114","SH 114","SH 121","International Parkway","SL 12","SH 114","SH 121","PGBT (West)","IH 635 (North)","PGBT","SRT","IH 635 (North)","SH 114","IH 35E","IH 35E","SH 121","Collin Co. Outer Loop","Collin C/L","IH 30","IH 30","IH 635 (East)","US 80","US 175","IH 635 (East)","IH 45","US 67","PGBT","SH 360","IH 820 (East)","IH 20","IH 20 ","IH 30","IH 30","IH 30","IH 35E","US 67","IH 820 (East)","SH 360","PGBT","SH 183","SH 183","SH 183","PGBT","IH 635 (North)","IH 20 ","Tarrant C/L","IH 20","IH 20 ","US 80","IH 635 (North)","SL 12","SH 183","IH 35E","SL 12","IH 35E","SS 366","DNT","IH 45","US 175","IH 30","IH 35E","IH 30","IH 35E","SL 12","PGBT (North)","PGBT","Tarrant C/L","IH 30 ","IH 20","IH 30","IH 20","IH 820 (North)","IH 820 (East)","Tarrant C/L","US 287","IH 35W","IH 35W","IH 35E","SH 170","US 287","IH 20","IH 20","SL 12","SH 183","SH 114","PGBT (West)","US 75","SRT","IH 635 (North)","IH 35E","Rockwall C/L","IH 45"]
["To_Facility",null,"To_Facility","IH 35E/IH35W","US 67","SRT","PGBT (North)","IH 35E","US 75","IH 30","US 75","IH 30","IH 635 (East)","PGBT","Rockwall C/L","IH 30","IH 20","IH 35W","IH 820 (West)","IH 820 (West)","CTP","IH 35W","IH 820 (East)","IH 820 (East)","IH 30","IH 30","IH 35W","IH 820 (East)","US 287","IH 20","IH 30","SH 121","IH 820 (East)","SH 183","SH 360","SH 183","PGBT","SH 183","SH 360  ","International Parkway/DFW Connector","PGBT (West)","IH 635 (North)","SH 183","PGBT (West)","IH 35E","IH 35E","IH 635 (North)","PGBT","SH 114","US 287","DNT","DNT","SRT","SH 121","Collin Co. Outer Loop","US 80","IH 635 (East)","IH 20","IH 20","IH 635 (East)","US 80","US 175","IH 35E","SL 12","PGBT","US 287","SH 360 Toll","US 287","IH 20","IH 20","IH 20","IH 20","IH 20","SH 360 ","PGBT","SL 12","IH 30","IH 30","IH 30","SL 12","SL 12","US 67","FM 917","SL 9","SH 34","Kaufman C/L","SS 366","SH 183","IH 35E","SH 183","SH 114","US 75","IH 30","IH 30","IH 20","IH 20","US 175","IH 35E","US 67","IH 45","IH 35E","IH 635 (North)","IH 635 (North)","IH 820 (North)","SH 199","IH 30","IH 20","Tarrant C/L","SH 121","IH 35W","IH 35W","IH 820 (North)","SH 183","SRT","IH 635 (North)","SH 121","SH 360","SH 360","US 77","US 67","DNT","IH 35E","SH 183","DNT","PGBT","IH 35E","IH 45","SS 302","US 80"]
[null,null,"Statement","Continue to Monitor","Partial Construction","Partial Construction","Corridor Study","Full Construction","Continue to Monitor","Continue to Monitor","Continue to Monitor","Full Construction","Continue to Monitor","Corridor Study","Partial Construction","Partial Construction","Continue to Monitor","Continue to Monitor","Continue to Monitor","Continue to Monitor","Continue to Monitor","Continue to Monitor","Continue to Monitor","Continue to Monitor","Partial Construction","Continue to Monitor","Continue to Monitor","Continue to Monitor","Full Construction","Full Construction","Partial Construction","Full Construction","Continue to Monitor","Full Construction","Partial Construction","Continue to Monitor","Recent Construction","Continue to Monitor","Continue to Monitor","Continue to Monitor","CMP Strategy","Full Construction","Full Construction","Partial Construction","Continue to Monitor","Full Construction","Full Construction","Full Construction","Continue to Monitor","Partial Construction","Continue to Monitor","Recent Construction","Continue to Monitor","Continue to Monitor","Continue to Monitor","CMP Strategy","Continue to Monitor","Rehab","Continue to Monitor","CMP Strategy","Continue to Monitor","Continue to Monitor","CMP Strategy","Partial Construction","CMP Strategy","Partial Construction","Continue to Monitor","Recent Construction","Full Construction","Full Construction","Rehab","Full Construction","Continue to Monitor","Partial Construction","Full Construction","Partial Construction","Full Construction","Full Construction","Partial Construction","Recent Construction","CMP Strategy","Continue to Monitor","Full Construction","Continue to Monitor","Continue to Monitor","Continue to Monitor","CMP Strategy","Full Construction","Rehab","Full Construction","Full Construction","CMP Strategy","CMP Strategy","Partial Construction","Partial Construction","Continue to Monitor","CMP Strategy","Recent Construction","Full Construction","Full Construction","Partial Construction","CMP Strategy","CMP Strategy","Full Construction","Continue to Monitor","Continue to Monitor","Continue to Monitor","Continue to Monitor","Partial Construction","Partial Construction","Partial Construction","Partial Construction","Continue to Monitor","CMP Strategy","Partial Construction","Partial Construction","Partial Construction","Partial Construction","Partial Construction","Partial Construction","Full Construction","Full Construction","Partial Construction","Full Construction","Continue to Monitor","CMP Strategy","Continue to Monitor","Partial Construction","CMP Strategy"]
["CMP2019","Column1","CMP20192","3.1","5.1","21.1","21.2","11.4","120.2","121.1","130.4","131.1","28.11","28.12","28.13","30.1","31.1","28.2","30.2","28.1","30.3","30.4","30.5","28.3","5.6","52.1","150.1","1.5","151.3","151.4","151.2","151.1","11.9","11.8","22.1","9.1","22.2","13.1","11.7","12.4","12.5","123.1","15.1","130.1","130.2","123.2","7.3","7.2","11.6","5.2","130.3","120.1","23.3","23.2","23.1","131.2","32.1","32.2","131.3","30.14","30.15","30.13","30.11","30.9","30.8","30.6","1.6","9.4","9.3","15.3","17.3","38.1","7.9","28.4","28.5","28.6","9.2","15.2","17.2","22.3","7.4","31.2","5.9","27.3","36.3","30.16","23.6","7.5","42.1","17.1","22.4","44.1","25.1","7.7","36.1","27.2","27.1","28.8","7.8","28.9","28.7","21.3","23.5","14.2","153.2","153.1","5.7","5.8","5.5","11.10","1.4","5.4","150.2","7.1","11.5","12.3","30.7","38.2","7.10","30.10","7.6","22.5","12.6","11.3","23.4","21.4","30.12","28.14","28.10"]
["Commuter Transportation Options",1.5,"Bike Share",0,0.16666666666666666,0.66666666666666663,0.16666666666666666,0,0.33333333333333331,0,0.33333333333333331,0.16666666666666666,0.33333333333333331,0.16666666666666666,0,0,0.16666666666666666,0.33333333333333331,0,0,0,0.16666666666666666,0.16666666666666666,1,0.33333333333333331,0.16666666666666666,0,0.16666666666666666,0.16666666666666666,0.16666666666666666,0,0.16666666666666666,0,0,0,0,0.33333333333333331,0.33333333333333331,0,0,0.33333333333333331,0,0.16666666666666666,0,0.33333333333333331,0,0,0,0.16666666666666666,0.16666666666666666,0.33333333333333331,0,0,0.66666666666666663,0,0,1,0,0,0,0,0,1,0,0,0.16666666666666666,0,0,0,0.66666666666666663,0.16666666666666666,0.33333333333333331,1,0.66666666666666663,0.66666666666666663,0,0,0,0.16666666666666666,0.33333333333333331,0.33333333333333331,0.66666666666666663,0,0,0,0,0.33333333333333331,0.33333333333333331,0.33333333333333331,0.16666666666666666,1,1,1,0.33333333333333331,0.16666666666666666,0.16666666666666666,0.83333333333333337,1,0.33333333333333331,1,0.33333333333333331,0.33333333333333331,0.16666666666666666,0,0,0.66666666666666663,0.33333333333333331,0.16666666666666666,0.33333333333333331,0.16666666666666666,0,0.16666666666666666,0,0,0,0,0.16666666666666666,0,0,0.66666666666666663,0.33333333333333331,0.33333333333333331,0.16666666666666666,0,0,0.33333333333333331,0.16666666666666666,0,0.33333333333333331]
[null,3,"Bike/Transit Integration",0,0,0,0,0,0.33333333333333331,0,0.33333333333333331,0.33333333333333331,0.33333333333333331,0,0,0,0.33333333333333331,0.33333333333333331,0,0,0,0.33333333333333331,0.33333333333333331,0.66666666666666663,0.66666666666666663,0.33333333333333331,0,0.33333333333333331,0.33333333333333331,0,0,0,0,0,0,0,0.66666666666666663,0.33333333333333331,0,0,0.66666666666666663,0,0.33333333333333331,0,0.33333333333333331,0,0.33333333333333331,0.33333333333333331,0.33333333333333331,0,0.33333333333333331,0,0,0,0,0,0.33333333333333331,0,0,0,0,0,0.33333333333333331,0,0,0,0,0,0,0,0.33333333333333331,0.33333333333333331,0.33333333333333331,0,0,0,0,0,0.33333333333333331,0.66666666666666663,0.66666666666666663,0,0,0,0,0,0.66666666666666663,0.66666666666666663,0.33333333333333331,0,0.66666666666666663,0.33333333333333331,1,1,0.33333333333333331,0.33333333333333331,0.66666666666666663,0.66666666666666663,0.66666666666666663,0.66666666666666663,0.33333333333333331,0.33333333333333331,0.66666666666666663,0,0,0,0.33333333333333331,0,0.33333333333333331,0.33333333333333331,0,0,0,0.33333333333333331,0,0,0,0,0,0,0.66666666666666663,0.33333333333333331,0.33333333333333331,0,0,0.33333333333333331,0.33333333333333331,0,0.33333333333333331]
[null,1,"SOV Trip Reduction Programming / Commuter Financial Incentives",1,1,1,1,1,1,1,1,1,1,1,1,1,1,1,1,1,1,1,1,1,1,1,1,1,1,1,1,1,1,1,1,1,1,1,1,1,1,1,1,1,1,1,1,1,1,1,1,1,1,1,1,1,1,1,1,1,1,1,1,1,1,1,1,1,1,1,1,1,1,1,1,1,1,1,1,1,1,1,1,1,1,1,1,1,1,1,1,1,1,1,1,1,1,1,1,1,1,1,1,1,1,1,1,1,1,1,1,1,1,1,1,1,1,1,1,1,1,1,1,1,1,1,1,1,1]
[null,3,"Park and Ride",0,0.33333333333333331,0,0.33333333333333331,0,0.33333333333333331,0,0.33333333333333331,0,0.33333333333333331,0.33333333333333331,0,0,0,0.33333333333333331,0,0,0,0.33333333333333331,0.33333333333333331,0.66666666666666663,0.66666666666666663,0,0,0,0.33333333333333331,0.33333333333333331,0,0.33333333333333331,0,0,0,0,0.66666666666666663,0.33333333333333331,0,0,0.66666666666666663,0,0,0,0.33333333333333331,0,0.33333333333333331,0.33333333333333331,0.33333333333333331,0.33333333333333331,0.33333333333333331,0,0,0,0,0,0.33333333333333331,0,0,0,0,0,0.33333333333333331,0,0,0.33333333333333331,0,0,0,0,0.33333333333333331,0.33333333333333331,0.33333333333333331,0,0,0,0,0,0.33333333333333331,0.66666666666666663,0.66666666666666663,0,0,0,0,0,0.66666666666666663,0.66666666666666663,0.33333333333333331,0,0.66666666666666663,0.33333333333333331,1,1,0,0,0.33333333333333331,0.66666666666666663,0.66666666666666663,0.66666666666666663,0.33333333333333331,0.33333333333333331,0.33333333333333331,0,0,0,0.33333333333333331,0.33333333333333331,0.33333333333333331,0.33333333333333331,0,0.33333333333333331,0,0.33333333333333331,0,0,0.33333333333333331,0,0,0,0.66666666666666663,0.33333333333333331,0,0,0,0.33333333333333331,0.33333333333333331,0,0.33333333333333331]
[null,1,"Ridesharing and Ridematching- Carpool/Vanpool",0.5,0.5,0,0,0.5,0.5,0.5,1,1,0.5,0.5,0,0,0.5,0.5,0,0.5,0,0.5,0.5,0.5,1,0.5,0.5,0.5,0,0,0.5,0.5,0.5,0,1,0.5,1,0.5,0.5,1,1,0.5,0.5,0.5,0.5,0.5,1,1,0.5,0,1,0.5,0,0,0,0,0,0,0,0,0,0,0,0,0,0,0,0,0.5,0,0,0.5,0.5,0.5,0.5,1,0.5,0.5,0.5,1,1,0.5,0.5,0,0,0,0.5,0.5,0.5,1,1,0.5,0.5,0.5,0.5,0.5,0.5,0.5,0.5,0.5,1,0.5,1,0,0.5,0.5,0.5,0.5,1,0.5,0,0.5,1,0.5,0.5,0.5,0.5,0,0.5,0,0.5,0.5,1,0,0.5,0.5,0,0,1]
[null,3.5,"Transit",0.14285714285714285,0.42857142857142855,0,0.2857142857142857,0.14285714285714285,0.42857142857142855,0.14285714285714285,0.42857142857142855,0.14285714285714285,0.2857142857142857,0.42857142857142855,0,0,0.14285714285714285,0.42857142857142855,0,0.14285714285714285,0,0.42857142857142855,0.42857142857142855,0.7142857142857143,0.7142857142857143,0.14285714285714285,0.14285714285714285,0.14285714285714285,0.2857142857142857,0.2857142857142857,0.14285714285714285,0.42857142857142855,0,0,0.14285714285714285,0.14285714285714285,0.7142857142857143,0.42857142857142855,0.14285714285714285,0.14285714285714285,0.7142857142857143,0.14285714285714285,0.14285714285714285,0.14285714285714285,0.42857142857142855,0.14285714285714285,0.42857142857142855,0.42857142857142855,0.42857142857142855,0.2857142857142857,0.42857142857142855,0.14285714285714285,0,0,0,0,0.2857142857142857,0,0,0,0,0,0.2857142857142857,0,0,0.2857142857142857,0,0,0.14285714285714285,0,0.2857142857142857,0.42857142857142855,0.42857142857142855,0.14285714285714285,0.14285714285714285,0.14285714285714285,0.14285714285714285,0.14285714285714285,0.42857142857142855,0.7142857142857143,0.7142857142857143,0.14285714285714285,0.14285714285714285,0,0,0,0.7142857142857143,0.7142857142857143,0.42857142857142855,0.14285714285714285,0.7142857142857143,0.42857142857142855,1,1,0.14285714285714285,0.14285714285714285,0.42857142857142855,0.7142857142857143,0.7142857142857143,0.7142857142857143,0.42857142857142855,0.42857142857142855,0.42857142857142855,0,0.14285714285714285,0.14285714285714285,0.42857142857142855,0.42857142857142855,0.42857142857142855,0.42857142857142855,0,0.42857142857142855,0.14285714285714285,0.42857142857142855,0.14285714285714285,0.14285714285714285,0.42857142857142855,0,0.14285714285714285,0,0.7142857142857143,0.42857142857142855,0.14285714285714285,0,0.14285714285714285,0.42857142857142855,0.2857142857142857,0,0.42857142857142855]
[null,1,"Freight RR Grade Crossing",0,0,0,0,0,0,0,0,0,0,0,0,0,0,1,0,0,0,0,0,1,0,0,0,0,0,1,0,0,0,0,0,0,0,1,0,0,1,0,0,1,1,0,1,0,0,0,0,1,0,0,0,0,0,0,0,0,0,0,0,0,0,0,0,0,1,1,0,0,1,0,0,0,1,1,0,0,0,0,0,0,0,0,1,0,0,1,1,1,0,0,0,0,0,0,0,1,0,0,0,0,0,0,0,0,0,0,0,0,0,0,0,0,0,0,0,0,0,0,0,0,0,1,0,0,0]
[null,1,"Truck Lane Restrictions",0,0,0,0,0,0,0,0,1,0,0,0,0,0,1,0,0,1,1,1,1,0,0,1,0,0,0,0,0,0,0,0,0,0,0,0,0,0,0,0,0,0,0,0,0,0,0,0,0,0,0,0,1,0,0,1,0,0,0,1,1,1,1,0,0,1,0,0,0,1,0,0,1,1,0,1,0,0,0,0,1,0,0,0,0,0,0,0,0,0,0,1,1,1,0,1,0,0,0,1,0,1,1,1,1,0,0,0,0,0,0,0,0,1,0,0,1,0,0,0,0,1,0,1,0,0]
["Incentives to Use Alternative Modes",1,"Active Parking Mgmt",1,1,1,1,1,1,1,1,1,1,1,1,1,1,1,1,1,1,1,1,1,1,1,1,1,1,1,1,1,1,1,1,1,1,1,1,1,1,1,1,1,1,1,1,1,1,1,1,1,1,1,1,1,1,1,1,1,1,1,1,1,1,1,1,1,1,1,1,1,1,1,1,1,1,1,1,1,1,1,1,1,1,1,1,1,1,1,1,1,1,1,1,1,1,1,1,1,1,1,1,1,1,1,1,1,1,1,1,1,1,1,1,1,1,1,1,1,1,1,1,1,1,1,1,1,1]
[null,2,"HOV/Managed Lane Management",0.5,0,0.5,0.5,0.5,0.5,0.5,1,1,1,0.5,0.5,0,0.5,0.5,0,0,0.5,0.5,0.5,0.5,1,0.5,0.5,0.5,0.5,0.5,0,0.5,1,0.5,1,0.5,1,0,0.5,1,1,0.5,0.5,0.5,0.5,0.5,1,1,0.5,0,0.5,0.5,0.5,0.5,0,0.5,0.5,0.5,0.5,0.5,0,0.5,0.5,0.5,0.5,0.5,0,0.5,0.5,0.5,0.5,0.5,0.5,0.5,0.5,1,0.5,0.5,0.5,1,1,0.5,0,0,0,0,0.5,0.5,0,1,1,0.5,0.5,0.5,0.5,0.5,0.5,0.5,0.5,0.5,1,0.5,1,0,0.5,0.5,0.5,0.5,0.5,0.5,0,0,0.5,0.5,0,0,0.5,0,0.5,0.5,0.5,0.5,1,0.5,0.5,0.5,0.5,0,1]
[null,4,"Emergency Routing",0.5,0,0.75,0.5,0.5,0.25,0.25,0.5,0.25,0.5,0.5,0.25,0.25,0.25,0.5,0,0.25,0.5,0.5,0.5,0.75,0.25,0.25,0.25,0.5,0.5,0.75,0,0.5,0.5,0.5,0.5,0.5,0.25,0.25,0.5,0.25,0.5,0.5,0.5,0.5,0.5,0.25,0.75,0.5,0.25,0.25,0.25,0.5,0.5,0.75,0.25,0.5,0.75,0.25,0.25,0.25,0,0.25,0.75,0.25,0.5,0.5,0,0.5,0.75,1,0.25,0.5,1,0.5,0.5,0.25,0.5,0.5,0.5,0.5,0.25,0.5,0.25,0.25,0,0,0.75,0.25,0,0.75,1,1,0.5,0.25,0.25,0.25,0.5,0.5,0.25,0.75,0.25,0.5,0.5,0.25,0.5,0.75,0.5,0.5,0,0.5,0,0,0,0.5,0.25,0.25,0.25,0.25,0.5,0.5,0.5,0.5,0.5,0.5,0.5,0.5,0.5,0.25,0.25]
[null,1.5,"Mobility Assistance Patrol / Courtesy Patrol",0.66666666666666663,0,0.66666666666666663,0.66666666666666663,0.66666666666666663,0.66666666666666663,1,0.66666666666666663,0.66666666666666663,0.66666666666666663,0.66666666666666663,0.66666666666666663,0,0.66666666666666663,0.66666666666666663,0.33333333333333331,0.33333333333333331,1,1,1,1,1,1,1,1,0.66666666666666663,1,0.33333333333333331,1,0.66666666666666663,0.66666666666666663,1,1,1,0.33333333333333331,1,1,0.66666666666666663,1,0.66666666666666663,1,1,0.66666666666666663,0.66666666666666663,1,1,0,0,0.66666666666666663,1,1,0.33333333333333331,1,0.66666666666666663,0.66666666666666663,1,1,0.33333333333333331,1,1,1,1,1,0,0.66666666666666663,1,0.66666666666666663,0.66666666666666663,0.66666666666666663,1,1,1,0.66666666666666663,1,0.66666666666666663,0.66666666666666663,1,0.66666666666666663,0.66666666666666663,0,0.33333333333333331,0.33333333333333331,0,0.66666666666666663,1,0.33333333333333331,1,1,1,0.66666666666666663,0.66666666666666663,0.66666666666666663,1,1,1,0.66666666666666663,0.66666666666666663,0.66666666666666663,0.66666666666666663,0.66666666666666663,0,1,1,1,1,0,0.66666666666666663,0,0.33333333333333331,0,0.66666666666666663,0,0.33333333333333331,1,0,1,0.66666666666666663,1,0.66666666666666663,0.66666666666666663,0.66666666666666663,0.66666666666666663,0.66666666666666663,1,0,0.66666666666666663]
[null,3.5,"Strategic Incident Response and Clearance Time Program",0.42857142857142855,0,0.5714285714285714,0.42857142857142855,0.42857142857142855,0.2857142857142857,0.5714285714285714,0.42857142857142855,0.2857142857142857,0.42857142857142855,0.42857142857142855,0.2857142857142857,0.14285714285714285,0.2857142857142857,0.42857142857142855,0.2857142857142857,0.42857142857142855,0.7142857142857143,0.7142857142857143,0.7142857142857143,0.8571428571428571,0.5714285714285714,0.5714285714285714,0.5714285714285714,0.7142857142857143,0.42857142857142855,0.8571428571428571,0.2857142857142857,0.7142857142857143,0.42857142857142855,0.42857142857142855,0.7142857142857143,0.7142857142857143,0.5714285714285714,0.42857142857142855,0.7142857142857143,0.5714285714285714,0.42857142857142855,0.7142857142857143,0.42857142857142855,0.7142857142857143,0.7142857142857143,0.2857142857142857,0.5714285714285714,0.7142857142857143,0.5714285714285714,0.14285714285714285,0.14285714285714285,0.42857142857142855,0.7142857142857143,0.8571428571428571,0.42857142857142855,0.7142857142857143,0.5714285714285714,0.2857142857142857,0.5714285714285714,0.5714285714285714,0.2857142857142857,0.5714285714285714,0.8571428571428571,0.5714285714285714,0.7142857142857143,0.7142857142857143,0,0.42857142857142855,0.8571428571428571,0.7142857142857143,0.2857142857142857,0.42857142857142855,1,0.7142857142857143,0.7142857142857143,0.2857142857142857,0.7142857142857143,0.42857142857142855,0.42857142857142855,0.7142857142857143,0.2857142857142857,0.42857142857142855,0.14285714285714285,0.42857142857142855,0.2857142857142857,0,0.5714285714285714,0.5714285714285714,0.2857142857142857,0.8571428571428571,1,1,0.42857142857142855,0.2857142857142857,0.2857142857142857,0.5714285714285714,0.7142857142857143,0.7142857142857143,0.2857142857142857,0.5714285714285714,0.2857142857142857,0.42857142857142855,0.42857142857142855,0.14285714285714285,0.7142857142857143,0.8571428571428571,0.7142857142857143,0.7142857142857143,0,0.42857142857142855,0,0.2857142857142857,0,0.42857142857142855,0.14285714285714285,0.42857142857142855,0.5714285714285714,0.14285714285714285,0.7142857142857143,0.42857142857142855,0.7142857142857143,0.42857142857142855,0.42857142857142855,0.42857142857142855,0.42857142857142855,0.42857142857142855,0.7142857142857143,0.14285714285714285,0.2857142857142857]
[null,1,"Traffic Incident Management Training",0,0,0,0,0,0,0,0,0,0,0,0,0,0,0,0,0,0,0,0,0,0,0,0,0,0,0,0,0,0,0,0,0,0,0,0,0,0,0,0,0,0,0,0,0,0,0,0,0,0,0,0,0,0,0,0,0,0,0,0,0,0,0,0,0,0,0,0,0,0,0,0,0,0,0,0,0,0,0,0,0,0,1,0,0,0,0,0,0,0,0,0,0,0,0,0,0,0,0,0,0,0,0,0,0,0,0,0,0,0,0,0,0,0,0,0,0,0,0,0,0,0,0,0,1,0]
["Roadway Infrastructure Improvements",2,"Access Management Improvements (Turn Lanes, Close Driveways)",0.5,0,1,0.5,0.5,0,0,0.5,0,0.5,0.5,0,0.5,0,0,0,0.5,0.5,0.5,0.5,0.5,0,0,0,0.5,0.5,0.5,0,0.5,0.5,0.5,0.5,0.5,0,0,0.5,0,0,0.5,0.5,0,0,0,0.5,0.5,0,0.5,0.5,0,0.5,1,0.5,0.5,1,0,0,0,0,0,1,0,0.5,0.5,0,0.5,0.5,1,0,0.5,1,0.5,0.5,0,0,0,0.5,0.5,0,0.5,0.5,0.5,0,0,0.5,0,0,0.5,1,1,0.5,0,0,0,0.5,0.5,0,0.5,0,0.5,0.5,0.5,0.5,1,0.5,0.5,0,0.5,0,0,0,0.5,0.5,0.5,0,0.5,0.5,0.5,0.5,0.5,0.5,0.5,0.5,0,0.5,0.5,0]
[null,1,"Bottleneck Removal",1,1,0,1,0,0,0,0,0,0,1,1,1,0,1,0,1,1,1,1,1,1,0,1,0,1,1,1,0,0,0,0,1,0,0,0,1,1,0,1,0,1,0,0,0,0,0,0,0,1,1,0,1,0,0,0,0,1,0,0,0,0,1,0,1,0,0,0,0,0,0,0,1,0,1,1,0,1,1,0,0,0,0,1,0,0,0,0,1,0,1,1,0,1,0,1,1,1,1,0,1,1,0,1,1,1,1,0,1,0,1,1,1,0,0,1,0,0,1,1,1,0,0,0,0,1]
[null,1.5,"Bus Loading Bays",0,0,0.33333333333333331,0,0,0.66666666666666663,0,0.66666666666666663,0.66666666666666663,0.66666666666666663,0,0,0,0.66666666666666663,0.66666666666666663,0,0,0,0.66666666666666663,0.66666666666666663,1,0.66666666666666663,0.66666666666666663,0,0.66666666666666663,0.66666666666666663,0,0,0,0,0,0,0,0.66666666666666663,0.66666666666666663,0,0,0.66666666666666663,0,0.66666666666666663,0,0.66666666666666663,0,0,0,0.66666666666666663,0,0.66666666666666663,0,0,0.33333333333333331,0,0,1,0,0,0,0,0,1,0,0,0,0,0,0,0.33333333333333331,0.66666666666666663,0.66666666666666663,1,0.33333333333333331,0.33333333333333331,0,0,0,0.66666666666666663,0.66666666666666663,0.66666666666666663,0.33333333333333331,0,0,0,0,0.66666666666666663,0.66666666666666663,0.66666666666666663,0,1,1,1,0.66666666666666663,0.66666666666666663,0.66666666666666663,1,1,0.66666666666666663,1,0.66666666666666663,0.66666666666666663,0.66666666666666663,0,0,0.33333333333333331,0.66666666666666663,0,0.66666666666666663,0,0,0,0,0,0,0,0,0,0,0.33333333333333331,0.66666666666666663,0.66666666666666663,0.66666666666666663,0,0,0.66666666666666663,0.66666666666666663,0,0.66666666666666663]
[null,1,"Intersection Improvements",1,1,1,1,1,1,1,1,1,1,1,1,1,1,1,1,1,1,1,1,1,1,1,1,1,1,1,1,1,1,1,1,1,1,1,1,1,1,1,1,1,1,1,1,1,1,1,1,1,1,1,1,1,1,1,1,1,1,1,1,1,1,1,1,1,1,1,1,1,1,1,1,1,1,1,1,1,1,1,1,1,1,1,1,1,1,1,1,1,1,1,1,1,1,1,1,1,1,1,1,1,1,1,1,1,1,1,1,1,1,1,1,1,1,1,1,1,1,1,1,1,1,1,1,1,1]
["Sustainable Development Improvements",2.5,"Bike/Ped Improvements",0,0,0.4,0,0,0.2,0,0.2,0.2,0.2,0,0,0,0.2,0.2,0,0,0,0.2,0.2,0.8,0.4,0.2,0,0.2,0.2,0,0,0,0,0,0,0,0.4,0.2,0,0,0.4,0,0.2,0,0.2,0,0.2,0.2,0.2,0,0.2,0,0,0.4,0,0,0.6,0,0,0,0,0,0.6,0,0,0,0,0,0,0.4,0.2,0.2,0.6,0.4,0.4,0,0,0,0.2,0.4,0.4,0.4,0,0,0,0,0.4,0.4,0.2,0,0.8,0.6,1,0.6,0.2,0.2,0.8,0.8,0.4,0.8,0.2,0.2,0.4,0,0,0.4,0.2,0,0.2,0.2,0,0,0,0.2,0,0,0,0,0,0.4,0.4,0.2,0.2,0,0,0.2,0.2,0,0.2]
[null,2.5,"Bike Parking Facilities",0,0,0.4,0,0,0.2,0,0.2,0.2,0.2,0,0,0,0.2,0.2,0,0,0,0.2,0.2,0.8,0.4,0.2,0,0.2,0.2,0,0,0,0,0,0,0,0.4,0.2,0,0,0.4,0,0.2,0,0.2,0,0.2,0.2,0.2,0,0.2,0,0,0.4,0,0,0.6,0,0,0,0,0,0.6,0,0,0,0,0,0,0.4,0.2,0.2,0.6,0.4,0.4,0,0,0,0.2,0.4,0.4,0.4,0,0,0,0,0.4,0.4,0.2,0,0.8,0.6,1,0.6,0.2,0.2,0.8,0.8,0.4,0.8,0.2,0.2,0.4,0,0,0.4,0.2,0,0.2,0.2,0,0,0,0.2,0,0,0,0,0,0.4,0.4,0.2,0.2,0,0,0.2,0.2,0,0.2]
[null,0,"Context Sensitive Design","","","","","","","","","","","","","","","","","","","","","","","","","","","","","","","","","","","","","","","","","","","","","","","","","","","","","","","","","","","","","","","","","","","","","","","","","","","","","","","","","","","","","","","","","","","","","","","","","","","","","","","","","","","","","","","","","","","","","","","","","","","","","",""]
[null,0,"Location of Efficient Development","","","","","","","","","","","","","","","","","","","","","","","","","","","","","","","","","","","","","","","","","","","","","","","","","","","","","","","","","","","","","","","","","","","","","","","","","","","","","","","","","","","","","","","","","","","","","","","","","","","","","","","","","","","","","","","","","","","","","","","","","","","","","",""]
[null,1,"Pedestrianized Streets",0,0,1,0,0,0,0,0,0,0,0,0,0,0,0,0,0,0,0,0,1,0,0,0,0,0,0,0,0,0,0,0,0,0,0,0,0,0,0,0,0,0,0,0,0,0,0,0,0,0,1,0,0,1,0,0,0,0,0,1,0,0,0,0,0,0,1,0,0,1,1,1,0,0,0,0,0,0,1,0,0,0,0,0,0,0,0,1,1,1,0,0,0,1,1,0,1,0,0,0,0,0,1,0,0,0,0,0,0,0,0,0,0,0,0,0,1,0,0,0,0,0,0,0,0,0]
[null,3,"Transit Oriented Development",0,0,0,0,0,0.33333333333333331,0,0.33333333333333331,0.33333333333333331,0.33333333333333331,0,0,0,0.33333333333333331,0.33333333333333331,0,0,0,0.33333333333333331,0.33333333333333331,0.66666666666666663,0.66666666666666663,0.33333333333333331,0,0.33333333333333331,0.33333333333333331,0,0,0,0,0,0,0,0.66666666666666663,0.33333333333333331,0,0,0.66666666666666663,0,0.33333333333333331,0,0.33333333333333331,0,0.33333333333333331,0.33333333333333331,0.33333333333333331,0,0.33333333333333331,0,0,0,0,0,0.33333333333333331,0,0,0,0,0,0.33333333333333331,0,0,0,0,0,0,0,0.33333333333333331,0.33333333333333331,0.33333333333333331,0,0,0,0,0,0.33333333333333331,0.66666666666666663,0.66666666666666663,0,0,0,0,0,0.66666666666666663,0.66666666666666663,0.33333333333333331,0,0.66666666666666663,0.33333333333333331,1,1,0.33333333333333331,0.33333333333333331,0.66666666666666663,0.66666666666666663,0.66666666666666663,0.66666666666666663,0.33333333333333331,0.33333333333333331,0.66666666666666663,0,0,0,0.33333333333333331,0,0.33333333333333331,0.33333333333333331,0,0,0,0.33333333333333331,0,0,0,0,0,0,0.66666666666666663,0.33333333333333331,0.33333333333333331,0,0,0.33333333333333331,0.33333333333333331,0,0.33333333333333331]
["System Management and Operations Improvements",2,"Active Traffic Managemtent (Lane Assignment, Re-Striping, Turning Movement and lane use restrictions",0.5,0,1,0.5,0.5,0,0,0.5,0,0.5,0.5,0,0.5,0,0,0,0.5,0.5,0.5,0.5,0.5,0,0,0,0.5,0.5,0.5,0,0.5,0.5,0.5,0.5,0.5,0,0,0.5,0,0,0.5,0.5,0,0,0,0.5,0.5,0,0.5,0.5,0,0.5,1,0.5,0.5,1,0,0,0,0,0,1,0,0.5,0.5,0,0.5,0.5,1,0,0.5,1,0.5,0.5,0,0,0,0.5,0.5,0,0.5,0.5,0.5,0,0,0.5,0,0,0.5,1,1,0.5,0,0,0,0.5,0.5,0,0.5,0,0.5,0.5,0.5,0.5,1,0.5,0.5,0,0.5,0,0,0,0.5,0.5,0.5,0,0.5,0.5,0.5,0.5,0.5,0.5,0.5,0.5,0,0.5,0.5,0]
[null,1,"ITS Devices",0,0,0,0,0,0,0,0,0,0,0,0,1,0,0,1,1,0,0,0,0,0,0,0,0,0,0,0,0,0,0,0,0,0,1,0,0,0,0,0,0,0,0,0,0,0,0,0,0,0,0,0,0,0,0,0,0,0,0,0,0,0,0,0,0,0,0,0,0,0,0,0,0,0,0,0,0,0,0,1,1,1,0,0,0,0,0,0,0,0,0,0,0,0,0,0,0,0,0,0,0,0,0,0,0,0,0,1,1,0,0,0,0,0,1,0,0,0,0,0,0,0,0,0,1,0]
[null,1,"Probe Surveilance",1,1,1,1,1,1,1,1,1,1,1,1,1,1,1,1,1,1,1,1,1,1,1,1,1,1,1,1,1,1,1,1,1,1,1,1,1,1,1,1,1,1,1,1,1,1,1,1,1,1,1,1,1,1,1,1,1,1,1,1,1,1,1,1,1,1,1,1,1,1,1,1,1,1,1,1,1,1,1,1,1,1,1,1,1,1,1,1,1,1,1,1,1,1,1,1,1,1,1,1,1,1,1,1,1,1,1,1,1,1,1,1,1,1,1,1,1,1,1,1,1,1,1,1,1,1]
[null,4,"Regional Traffic Control",0.5,0,0.75,0.5,0.5,0.25,0.25,0.5,0.25,0.5,0.5,0.25,0.25,0.25,0.5,0,0.25,0.5,0.5,0.5,0.75,0.25,0.25,0.25,0.5,0.5,0.75,0,0.5,0.5,0.5,0.5,0.5,0.25,0.25,0.5,0.25,0.5,0.5,0.5,0.5,0.5,0.25,0.75,0.5,0.25,0.25,0.25,0.5,0.5,0.75,0.25,0.5,0.75,0.25,0.25,0.25,0,0.25,0.75,0.25,0.5,0.5,0,0.5,0.75,1,0.25,0.5,1,0.5,0.5,0.25,0.5,0.5,0.5,0.5,0.25,0.5,0.25,0.25,0,0,0.75,0.25,0,0.75,1,1,0.5,0.25,0.25,0.25,0.5,0.5,0.25,0.75,0.25,0.5,0.5,0.25,0.5,0.75,0.5,0.5,0,0.5,0,0,0,0.5,0.25,0.25,0.25,0.25,0.5,0.5,0.5,0.5,0.5,0.5,0.5,0.5,0.5,0.25,0.25]
[null,0.5,"Reversible Lane Management",0,0,1,0,0,0,0,0,0,0,0,0,0,0,0,0,0,0,0,0,1,0,0,0,0,0,0,0,0,0,0,0,0,0,0,0,0,0,0,0,0,0,0,0,0,0,0,0,0,0,1,0,0,1,0,0,0,0,0,1,0,0,0,0,0,0,1,0,0,1,1,1,0,0,0,0,0,0,1,0,0,0,0,0,0,0,0,1,1,1,0,0,0,1,1,0,1,0,0,0,0,0,1,0,0,0,0,0,0,0,0,0,0,0,0,0,1,0,0,0,0,0,0,0,0,0]
[null,1,"Shoulder Utilization Program",0,0,0,0,0,0,1,0,0,0,0,0,0,0,0,1,1,1,1,1,1,1,1,1,1,0,1,1,1,0,0,1,1,1,1,1,1,0,1,0,1,1,0,0,1,1,0,0,0,1,1,1,1,0,0,1,1,1,1,1,1,1,1,0,0,1,0,0,0,1,1,1,0,1,0,0,1,0,0,0,1,1,0,0,1,1,1,1,1,0,0,0,1,1,1,0,0,0,0,0,0,1,1,1,1,0,0,0,1,0,0,0,1,1,0,1,0,1,0,0,0,0,0,1,0,0]
[null,2,"Traffic Signal Improvements",0.5,0,1,0.5,0.5,0,0,0.5,0,0.5,0.5,0,0.5,0,0,0,0.5,0.5,0.5,0.5,0.5,0,0,0,0.5,0.5,0.5,0,0.5,0.5,0.5,0.5,0.5,0,0,0.5,0,0,0.5,0.5,0,0,0,0.5,0.5,0,0.5,0.5,0,0.5,1,0.5,0.5,1,0,0,0,0,0,1,0,0.5,0.5,0,0.5,0.5,1,0,0.5,1,0.5,0.5,0,0,0,0.5,0.5,0,0.5,0.5,0.5,0,0,0.5,0,0,0.5,1,1,0.5,0,0,0,0.5,0.5,0,0.5,0,0.5,0.5,0.5,0.5,1,0.5,0.5,0,0.5,0,0,0,0.5,0.5,0.5,0,0.5,0.5,0.5,0.5,0.5,0.5,0.5,0.5,0,0.5,0.5,0]
[null,1,"Speed Harmonization and Monitoring",1,1,1,1,1,1,1,1,1,1,1,1,1,1,1,1,1,1,1,1,1,1,1,1,1,1,1,1,1,1,1,1,1,1,1,1,1,1,1,1,1,1,1,1,1,1,1,1,1,1,1,1,1,1,1,1,1,1,1,1,1,1,1,1,1,1,1,1,1,1,1,1,1,1,1,1,1,1,1,1,1,1,1,1,1,1,1,1,1,1,1,1,1,1,1,1,1,1,1,1,1,1,1,1,1,1,1,1,1,1,1,1,1,1,1,1,1,1,1,1,1,1,1,1,1,1]
["Transit System Efficiency Improvements",1,"Demand Response Transit Operations",1,0,1,0,1,0,1,0,0,0,0,1,1,0,0,1,1,1,0,0,0,0,0,1,0,0,0,1,0,1,1,1,1,0,0,1,0,0,1,0,1,0,1,0,1,0,0,0,1,1,1,1,1,0,1,1,1,1,1,0,1,1,0,1,1,1,1,0,0,0,1,1,1,1,1,0,0,0,1,1,1,1,1,0,0,0,0,0,0,0,0,0,0,0,0,0,0,0,0,0,1,1,1,0,0,0,0,1,0,1,1,1,1,0,1,1,1,0,0,0,1,1,0,0,1,0]
[null,3,"Adaptive/Demand Responsive Signal Systems",0.33333333333333331,0,0.66666666666666663,0.33333333333333331,0.33333333333333331,0.33333333333333331,0,0.66666666666666663,0.33333333333333331,0.66666666666666663,0.33333333333333331,0,0.33333333333333331,0.33333333333333331,0.33333333333333331,0,0.33333333333333331,0.33333333333333331,0.66666666666666663,0.66666666666666663,0.66666666666666663,0.33333333333333331,0.33333333333333331,0,0.66666666666666663,0.66666666666666663,0.33333333333333331,0,0.33333333333333331,0.33333333333333331,0.33333333333333331,0.33333333333333331,0.33333333333333331,0.33333333333333331,0.33333333333333331,0.33333333333333331,0,0.33333333333333331,0.33333333333333331,0.66666666666666663,0,0.33333333333333331,0,0.33333333333333331,0.33333333333333331,0.33333333333333331,0.33333333333333331,0.66666666666666663,0,0.33333333333333331,0.66666666666666663,0.33333333333333331,0.33333333333333331,1,0,0,0,0,0,1,0,0.33333333333333331,0.33333333333333331,0,0.33333333333333331,0.33333333333333331,0.66666666666666663,0.33333333333333331,0.66666666666666663,1,0.33333333333333331,0.33333333333333331,0,0,0,0.66666666666666663,0.66666666666666663,0.33333333333333331,0.33333333333333331,0.33333333333333331,0.33333333333333331,0,0,0.66666666666666663,0.33333333333333331,0.33333333333333331,0.33333333333333331,1,1,0.66666666666666663,0.33333333333333331,0.33333333333333331,0.33333333333333331,0.66666666666666663,0.66666666666666663,0.33333333333333331,0.66666666666666663,0.33333333333333331,0.66666666666666663,0.66666666666666663,0.33333333333333331,0.33333333333333331,0.66666666666666663,0.66666666666666663,0.33333333333333331,0.33333333333333331,0.33333333333333331,0,0,0,0.33333333333333331,0.33333333333333331,0.33333333333333331,0,0.33333333333333331,0.33333333333333331,0.33333333333333331,0.66666666666666663,0.66666666666666663,0.66666666666666663,0.33333333333333331,0.33333333333333331,0.33333333333333331,0.66666666666666663,0.33333333333333331,0.33333333333333331]
[null,4,"Transit Fixed-Route Operations",0.25,0,0.5,0.25,0.25,0.25,0,0.75,0.5,0.75,0.25,0,0.25,0.25,0.25,0,0.25,0.25,0.5,0.5,0.5,0.5,0.25,0,0.5,0.5,0.25,0,0.25,0.5,0.25,0.5,0.25,0.5,0.25,0.25,0.25,0.5,0.25,0.5,0,0.25,0,0.5,0.5,0.25,0.25,0.75,0,0.25,0.5,0.25,0.25,0.75,0,0,0,0,0,0.75,0,0.25,0.25,0,0.25,0.25,0.5,0.25,0.5,0.75,0.25,0.25,0.25,0,0,0.5,0.75,0.5,0.25,0.25,0.25,0,0,0.5,0.25,0.25,0.5,1,0.75,0.5,0.25,0.25,0.25,0.5,0.5,0.25,0.5,0.5,0.5,0.75,0.25,0.25,0.5,0.5,0.25,0.5,0.25,0,0,0.25,0.25,0.25,0.25,0,0.25,0.25,0.25,0.5,0.5,0.75,0.25,0.25,0.25,0.5,0.25,0.5]
[null,5,"Transit Management",0,0,0.2,0,0,0.2,0,0.4,0.4,0.4,0,0,0,0.2,0.2,0,0,0,0.2,0.2,0.6,0.6,0.2,0,0.2,0.2,0,0,0,0.2,0,0.2,0,0.6,0.2,0,0.2,0.6,0,0.2,0,0.2,0,0.4,0.4,0.2,0,0.4,0,0,0.2,0,0,0.4,0,0,0,0,0,0.4,0,0,0,0,0,0,0.2,0.2,0.2,0.4,0.2,0.2,0.2,0,0,0.2,0.6,0.6,0.2,0,0,0,0,0.4,0.4,0.2,0.2,0.8,0.4,0.8,0.6,0.2,0.2,0.6,0.6,0.4,0.6,0.4,0.2,0.6,0,0,0.2,0.2,0,0.4,0.2,0,0,0.2,0.2,0,0,0,0,0,0.2,0.4,0.2,0.4,0,0,0.2,0.2,0,0.4]
[null,1,"Transit System Signal Priority",0,0,0,0,0,1,0,1,1,1,0,0,0,1,1,0,0,0,1,1,1,1,1,0,1,1,0,0,0,0,0,0,0,1,1,0,0,1,0,1,0,1,0,0,0,1,0,1,0,0,0,0,0,1,0,0,0,0,0,1,0,0,0,0,0,0,0,1,1,1,0,0,0,0,0,1,1,1,0,0,0,0,0,1,1,1,0,1,1,1,1,1,1,1,1,1,1,1,1,1,0,0,0,1,0,1,0,0,0,0,0,0,0,0,0,0,0,1,1,1,0,0,1,1,0,1]
[null,3,"Transit Vehicle Tracking",0,0,0,0,0,0.33333333333333331,0,0.33333333333333331,0.33333333333333331,0.33333333333333331,0,0,0,0.33333333333333331,0.33333333333333331,0,0,0,0.33333333333333331,0.33333333333333331,0.66666666666666663,0.66666666666666663,0.33333333333333331,0,0.33333333333333331,0.33333333333333331,0,0,0,0,0,0,0,0.66666666666666663,0.33333333333333331,0,0,0.66666666666666663,0,0.33333333333333331,0,0.33333333333333331,0,0.33333333333333331,0.33333333333333331,0.33333333333333331,0,0.33333333333333331,0,0,0,0,0,0.33333333333333331,0,0,0,0,0,0.33333333333333331,0,0,0,0,0,0,0,0.33333333333333331,0.33333333333333331,0.33333333333333331,0,0,0,0,0,0.33333333333333331,0.66666666666666663,0.66666666666666663,0,0,0,0,0,0.66666666666666663,0.66666666666666663,0.33333333333333331,0,0.66666666666666663,0.33333333333333331,1,1,0.33333333333333331,0.33333333333333331,0.66666666666666663,0.66666666666666663,0.66666666666666663,0.66666666666666663,0.33333333333333331,0.33333333333333331,0.66666666666666663,0,0,0,0.33333333333333331,0,0.33333333333333331,0.33333333333333331,0,0,0,0.33333333333333331,0,0,0,0,0,0,0.66666666666666663,0.33333333333333331,0.33333333333333331,0,0,0.33333333333333331,0.33333333333333331,0,0.33333333333333331]
["Traveler Information Services",1,511,1,1,1,1,1,1,1,1,1,1,1,1,1,1,1,1,1,1,1,1,1,1,1,1,1,1,1,1,1,1,1,1,1,1,1,1,1,1,1,1,1,1,1,1,1,1,1,1,1,1,1,1,1,1,1,1,1,1,1,1,1,1,1,1,1,1,1,1,1,1,1,1,1,1,1,1,1,1,1,1,1,1,1,1,1,1,1,1,1,1,1,1,1,1,1,1,1,1,1,1,1,1,1,1,1,1,1,1,1,1,1,1,1,1,1,1,1,1,1,1,1,1,1,1,1,1]
[null,1,"Integrated Transportation Management/Route Guidance",1,1,1,1,1,1,1,1,1,1,1,1,1,1,1,1,1,1,1,1,1,1,1,1,1,1,1,1,1,1,1,1,1,1,1,1,1,1,1,1,1,1,1,1,1,1,1,1,1,1,1,1,1,1,1,1,1,1,1,1,1,1,1,1,1,1,1,1,1,1,1,1,1,1,1,1,1,1,1,1,1,1,1,1,1,1,1,1,1,1,1,1,1,1,1,1,1,1,1,1,1,1,1,1,1,1,1,1,1,1,1,1,1,1,1,1,1,1,1,1,1,1,1,1,1,1]
[null,1,"Dynamic Pricing",0,0,1,1,1,1,1,1,1,0,0,0,0,1,0,0,0,0,0,0,0,1,0,0,0,0,0,0,0,1,0,1,0,1,1,0,1,1,1,1,0,0,1,1,1,0,0,1,1,0,0,0,0,0,0,0,0,0,0,0,0,0,0,0,1,0,1,0,0,0,0,0,1,0,1,0,1,1,1,0,0,0,0,0,0,0,1,1,0,0,0,0,0,0,0,0,0,1,1,0,0,0,0,0,0,1,0,0,0,1,0,0,0,0,0,0,0,0,0,1,1,0,1,0,0,0]
[null,0,"Dynamic Routing","","","","","","","","","","","","","","","","","","","","","","","","","","","","","","","","","","","","","","","","","","","","","","","","","","","","","","","","","","","","","","","","","","","","","","","","","","","","","","","","","","","","","","","","","","","","","","","","","","","","","","","","","","","","","","","","","","","","","","","","","","","","","",""]
[null,0,"Mobility as a service","","","","","","","","","","","","","","","","","","","","","","","","","","","","","","","","","","","","","","","","","","","","","","","","","","","","","","","","","","","","","","","","","","","","","","","","","","","","","","","","","","","","","","","","","","","","","","","","","","","","","","","","","","","","","","","","","","","","","","","","","","","","","",""]
[null,null,null,{"$f":"COUNTIF(Table2[3.1], 1)","v":9},{"$f":"COUNTIF(Table2[5.1], 1)","v":8},{"$f":"COUNTIF(Table2[21.1], 1)","v":14},{"$f":"COUNTIF(Table2[21.2], 1)","v":9},{"$f":"COUNTIF(Table2[11.4], 1)","v":9},{"$f":"COUNTIF(Table2[120.2], 1)","v":9},{"$f":"COUNTIF(Table2[121.1], 1)","v":11},{"$f":"COUNTIF(Table2[130.4], 1)","v":11},{"$f":"COUNTIF(Table2[131.1], 1)","v":12},{"$f":"COUNTIF(Table2[28.11], 1)","v":9},{"$f":"COUNTIF(Table2[28.12], 1)","v":8},{"$f":"COUNTIF(Table2[28.13], 1)","v":9},{"$f":"COUNTIF(Table2[30.1], 1)","v":10},{"$f":"COUNTIF(Table2[31.1], 1)","v":9},{"$f":"COUNTIF(Table2[28.2], 1)","v":11},{"$f":"COUNTIF(Table2[30.2], 1)","v":10},{"$f":"COUNTIF(Table2[28.1], 1)","v":11},{"$f":"COUNTIF(Table2[30.3], 1)","v":12},{"$f":"COUNTIF(Table2[30.4], 1)","v":12},{"$f":"COUNTIF(Table2[30.5], 1)","v":12},{"$f":"COUNTIF(Table2[28.3], 1)","v":17},{"$f":"COUNTIF(Table2[5.6], 1)","v":14},{"$f":"COUNTIF(Table2[52.1], 1)","v":10},{"$f":"COUNTIF(Table2[150.1], 1)","v":12},{"$f":"COUNTIF(Table2[1.5], 1)","v":10},{"$f":"COUNTIF(Table2[151.3], 1)","v":9},{"$f":"COUNTIF(Table2[151.4], 1)","v":11},{"$f":"COUNTIF(Table2[151.2], 1)","v":10},{"$f":"COUNTIF(Table2[151.1], 1)","v":9},{"$f":"COUNTIF(Table2[11.9], 1)","v":10},{"$f":"COUNTIF(Table2[11.8], 1)","v":8},{"$f":"COUNTIF(Table2[22.1], 1)","v":13},{"$f":"COUNTIF(Table2[9.1], 1)","v":11},{"$f":"COUNTIF(Table2[22.2], 1)","v":13},{"$f":"COUNTIF(Table2[13.1], 1)","v":12},{"$f":"COUNTIF(Table2[11.7], 1)","v":10},{"$f":"COUNTIF(Table2[12.4], 1)","v":13},{"$f":"COUNTIF(Table2[12.5], 1)","v":13},{"$f":"COUNTIF(Table2[123.1], 1)","v":11},{"$f":"COUNTIF(Table2[15.1], 1)","v":10},{"$f":"COUNTIF(Table2[130.1], 1)","v":11},{"$f":"COUNTIF(Table2[130.2], 1)","v":12},{"$f":"COUNTIF(Table2[123.2], 1)","v":9},{"$f":"COUNTIF(Table2[7.3], 1)","v":11},{"$f":"COUNTIF(Table2[7.2], 1)","v":13},{"$f":"COUNTIF(Table2[11.6], 1)","v":10},{"$f":"COUNTIF(Table2[5.2], 1)","v":7},{"$f":"COUNTIF(Table2[130.3], 1)","v":10},{"$f":"COUNTIF(Table2[120.1], 1)","v":10},{"$f":"COUNTIF(Table2[23.3], 1)","v":11},{"$f":"COUNTIF(Table2[23.2], 1)","v":16},{"$f":"COUNTIF(Table2[23.1], 1)","v":9},{"$f":"COUNTIF(Table2[131.2], 1)","v":12},{"$f":"COUNTIF(Table2[32.1], 1)","v":16},{"$f":"COUNTIF(Table2[32.2], 1)","v":8},{"$f":"COUNTIF(Table2[131.3], 1)","v":11},{"$f":"COUNTIF(Table2[30.14], 1)","v":10},{"$f":"COUNTIF(Table2[30.15], 1)","v":10},{"$f":"COUNTIF(Table2[30.13], 1)","v":10},{"$f":"COUNTIF(Table2[30.11], 1)","v":19},{"$f":"COUNTIF(Table2[30.9], 1)","v":11},{"$f":"COUNTIF(Table2[30.8], 1)","v":11},{"$f":"COUNTIF(Table2[30.6], 1)","v":11},{"$f":"COUNTIF(Table2[1.6], 1)","v":8},{"$f":"COUNTIF(Table2[9.4], 1)","v":10},{"$f":"COUNTIF(Table2[9.3], 1)","v":12},{"$f":"COUNTIF(Table2[15.3], 1)","v":17},{"$f":"COUNTIF(Table2[17.3], 1)","v":8},{"$f":"COUNTIF(Table2[38.1], 1)","v":8},{"$f":"COUNTIF(Table2[7.9], 1)","v":23},{"$f":"COUNTIF(Table2[28.4], 1)","v":12},{"$f":"COUNTIF(Table2[28.5], 1)","v":12},{"$f":"COUNTIF(Table2[28.6], 1)","v":13},{"$f":"COUNTIF(Table2[9.2], 1)","v":12},{"$f":"COUNTIF(Table2[15.2], 1)","v":11},{"$f":"COUNTIF(Table2[17.2], 1)","v":10},{"$f":"COUNTIF(Table2[22.3], 1)","v":13},{"$f":"COUNTIF(Table2[7.4], 1)","v":12},{"$f":"COUNTIF(Table2[31.2], 1)","v":12},{"$f":"COUNTIF(Table2[5.9], 1)","v":9},{"$f":"COUNTIF(Table2[27.3], 1)","v":11},{"$f":"COUNTIF(Table2[36.3], 1)","v":10},{"$f":"COUNTIF(Table2[30.16], 1)","v":9},{"$f":"COUNTIF(Table2[23.6], 1)","v":10},{"$f":"COUNTIF(Table2[7.5], 1)","v":10},{"$f":"COUNTIF(Table2[42.1], 1)","v":9},{"$f":"COUNTIF(Table2[17.1], 1)","v":13},{"$f":"COUNTIF(Table2[22.4], 1)","v":26},{"$f":"COUNTIF(Table2[44.1], 1)","v":23},{"$f":"COUNTIF(Table2[25.1], 1)","v":19},{"$f":"COUNTIF(Table2[7.7], 1)","v":14},{"$f":"COUNTIF(Table2[36.1], 1)","v":10},{"$f":"COUNTIF(Table2[27.2], 1)","v":11},{"$f":"COUNTIF(Table2[27.1], 1)","v":15},{"$f":"COUNTIF(Table2[28.8], 1)","v":14},{"$f":"COUNTIF(Table2[7.8], 1)","v":10},{"$f":"COUNTIF(Table2[28.9], 1)","v":14},{"$f":"COUNTIF(Table2[28.7], 1)","v":12},{"$f":"COUNTIF(Table2[21.3], 1)","v":10},{"$f":"COUNTIF(Table2[23.5], 1)","v":11},{"$f":"COUNTIF(Table2[14.2], 1)","v":9},{"$f":"COUNTIF(Table2[153.2], 1)","v":12},{"$f":"COUNTIF(Table2[153.1], 1)","v":16},{"$f":"COUNTIF(Table2[5.7], 1)","v":12},{"$f":"COUNTIF(Table2[5.8], 1)","v":11},{"$f":"COUNTIF(Table2[5.5], 1)","v":11},{"$f":"COUNTIF(Table2[11.10], 1)","v":8},{"$f":"COUNTIF(Table2[1.4], 1)","v":9},{"$f":"COUNTIF(Table2[5.4], 1)","v":10},{"$f":"COUNTIF(Table2[150.2], 1)","v":10},{"$f":"COUNTIF(Table2[7.1], 1)","v":9},{"$f":"COUNTIF(Table2[11.5], 1)","v":9},{"$f":"COUNTIF(Table2[12.3], 1)","v":10},{"$f":"COUNTIF(Table2[30.7], 1)","v":10},{"$f":"COUNTIF(Table2[38.2], 1)","v":9},{"$f":"COUNTIF(Table2[7.10], 1)","v":11},{"$f":"COUNTIF(Table2[30.10], 1)","v":11},{"$f":"COUNTIF(Table2[7.6], 1)","v":10},{"$f":"COUNTIF(Table2[22.5], 1)","v":9},{"$f":"COUNTIF(Table2[12.6], 1)","v":12},{"$f":"COUNTIF(Table2[11.3], 1)","v":10},{"$f":"COUNTIF(Table2[23.4], 1)","v":9},{"$f":"COUNTIF(Table2[21.4], 1)","v":10},{"$f":"COUNTIF(Table2[30.12], 1)","v":11},{"$f":"COUNTIF(Table2[28.14], 1)","v":10},{"$f":"COUNTIF(Table2[28.10], 1)","v":11}]

{"sheet":"Ref6","index":10,"n_rows":128,"n_cols":39,"rows_kept":128,"cut":false,"hidden":true,"merged":[]}
["Ref","CMP2019","Facility","From_Facility","To_Facility","Performance Statement","Asset Statement","Corridor Statement Pre-Con","Corridor Statement",null,"CrashRate","TravelTimeIndex","LOTTR","PvmtGood_Pct","PvmtPoor_Pct","BrdgGood_Pct","BrdgPoor_Pct","DAY_LOC","AvailableArterialCapacity","Frontage_Pct","ParallelFreeway_Pct","HOV_Pct","ParkAndRides","LightRail_Pct","CommuterRail_Pct","BusRoute_Pct","BusDensity","Shoulder","ITS_Pct","ManagedLane_Pct","TruckLaneRestriction_Pct","FreightRoute_Pct","TIM_Pct","MAP_Pct","Shape_Length","BusCombo","RoadwayAgg","MediumodaLowAgg","OpsAgg"]
[null,2,3,4,5,6,7,8,9,10,11,12,13,14,15,16,17,18,19,20,21,22,23,24,25,26,27,28,29,30,31,32,33,34,35,36,37,38,39]
[1,"3.1","IH 35","Denton C/L","IH 35E/IH35W","Continue to Monitor","Operate and may need options","Continue to Monitor","Continue to Monitor",null,0,0,0,0,0,0,0,0,"L","H","L","L","H","L","L","L","L","L","H","L","L","H","H","H","H","L","Low","Low","Medium"]
[2,"5.1","IH 35W","FM 917","US 67","Continue to Monitor","Needs Help","Continue to Monitor","Partial Construction",null,0,0,0,0,0,0,0,0,"L","L","L","L","H","L","L","H","L","L","M","L","L","H","H","H","H","M","Low","Low","Low"]
[3,"21.1","DNT","S of US 380 (Freeway Lanes)","SRT","Operational","Need modal options and operations","Impletment operational strategies","Partial Construction",null,1,0,0,0,0,0,0,0,"H","H","L","L","L","L","L","L","L","M","H","L","L","H","H","H","H","L","Medium","Low","Low"]
[4,"21.2","DNT","SRT","PGBT (North)","Demand Reduction and Operational","Operate and may need options","Promote trip reduction strategies and optimize existing operations","CMP Strategy",null,1,0,1,0,0,0,0,0,"M","H","L","L","H","L","L","H","L","L","H","L","L","H","H","H","H","M","Low","Low","Medium"]
[5,"11.4","SRT","DNT","IH 35E","Continue to Monitor","Operate and may need options","Continue to Monitor","Full Construction",null,0,0,0,0,0,0,0,0,"L","H","L","L","H","L","L","L","L","L","H","L","L","H","H","H","H","L","Low","Low","Medium"]
[6,"120.2","PGBT (North)","DNT","US 75","Continue to Monitor","Promote modal options and operate","Continue to Monitor","Continue to Monitor",null,0,0,0,0,0,0,0,0,"M","L","L","L","H","L","L","H","H","L","H","L","L","H","H","H","H","H","Low","Medium","Medium"]
[7,"121.1","PGBT (East)","US 75","IH 30","Continue to Monitor","Needs Help","Continue to Monitor","Continue to Monitor",null,0,0,0,0,0,0,0,0,"L","M","L","L","H","L","L","L","L","H","H","L","L","H","H","H","H","L","Low","Low","Low"]
[8,"130.4","IH 635 (North)","DNT","US 75","Continue to Monitor","Promote modal options and operate","Continue to Monitor","Continue to Monitor",null,0,0,0,0,0,0,0,0,"L","H","L","L","H","L","L","H","H","L","H","H","L","H","H","H","H","H","Low","Medium","High"]
[9,"131.1","IH 635 (East)","US 75","IH 30","Demand Reduction","Promote modal options and operate","Promote modal options and operate","Full Construction",null,0,1,0,0,0,0,0,0,"L","L","L","L","H","L","L","M","H","M","H","H","H","H","H","H","H","H","Low","Medium","High"]
[10,"28.11","IH 30","US 80","IH 635 (East)","Continue to Monitor","Needs Help","Continue to Monitor","Continue to Monitor",null,0,0,0,0,0,0,0,0,"M","H","L","H","L","L","L","H","H","M","H","L","L","H","H","H","H","H","Low","Low","Low"]
[11,"28.12","IH 30","IH 635 (East)","PGBT","Demand Reduction and Operational","Needs Help","Needs Corridor Study","Corridor Study",null,0,0,1,0,0,0,0,0,"L","H","L","L","H","L","L","H","L","M","H","L","L","H","H","H","H","M","Low","Low","Low"]
[12,"28.13","IH 30","PGBT","Rockwall C/L","Continue to Monitor","Needs Help","Continue to Monitor","Partial Construction",null,0,0,0,0,0,0,0,0,"L","M","L","L","L","L","L","L","L","M","H","L","L","H","H","H","H","L","Low","Low","Low"]
[13,"30.1","IH 20","SS 312","IH 30","Continue to Monitor","Needs Help","Continue to Monitor","Partial Construction",null,0,0,0,0,0,0,0,0,"L","H","L","L","L","L","L","L","L","L","L","L","L","H","H","H","H","L","Low","Low","Low"]
[14,"31.1","CTP","IH 30","IH 20","Continue to Monitor","Promote options, may need roadway capacity","Continue to Monitor","Continue to Monitor",null,0,0,0,0,0,0,0,0,"L","L","L","L","H","L","L","M","H","M","H","L","L","H","H","H","H","H","Low","Medium","Low"]
[15,"28.2","IH 30","IH 820 (West)","IH 35W","Continue to Monitor","Promote options and needs operations","Continue to Monitor","Continue to Monitor",null,0,0,0,0,0,0,0,0,"M","M","H","L","H","L","L","H","H","M","H","L","H","H","H","H","H","H","High","Medium","Low"]
[16,"30.2","IH 20","IH 30","IH 820 (West)","Continue to Monitor","Needs Help","Continue to Monitor","Continue to Monitor",null,0,0,0,0,0,0,0,0,"L","L","L","L","L","L","L","L","L","H","L","L","L","H","H","H","H","L","Low","Low","Low"]
[17,"28.1","IH 30","IH 20","IH 820 (West)","Continue to Monitor","Needs Help","Continue to Monitor","Continue to Monitor",null,0,0,0,0,0,0,0,0,"L","H","L","L","H","L","L","L","L","H","L","L","L","H","H","H","H","L","Low","Low","Low"]
[18,"30.3","IH 20","IH 820 (West)","CTP","Continue to Monitor","Operate and may need options","Continue to Monitor","Continue to Monitor",null,0,0,0,0,0,0,0,0,"L","H","L","L","L","L","L","L","L","H","H","L","H","H","H","H","H","L","Low","Low","Medium"]
[19,"30.4","IH 20","CTP","IH 35W","Continue to Monitor","Promote modal options and operate","Continue to Monitor","Continue to Monitor",null,0,0,0,0,0,0,0,0,"L","H","L","L","H","L","L","H","M","H","H","L","H","H","H","H","H","H","Low","Medium","Medium"]
[20,"30.5","IH 20","IH 35W","IH 820 (East)","Continue to Monitor","Promote modal options and operate","Continue to Monitor","Continue to Monitor",null,0,0,0,0,0,0,0,0,"L","H","L","L","H","L","L","H","M","H","H","L","H","H","H","H","H","H","Low","Medium","Medium"]
[21,"28.3","IH 30","IH 35W","IH 820 (East)","Continue to Monitor","Promote options and operate","Continue to Monitor","Continue to Monitor",null,0,0,0,0,0,0,0,0,"H","L","H","L","H","L","H","H","H","H","H","L","H","H","H","H","H","H","High","High","Medium"]
[22,"5.6","IH 35W","SH 121","IH 30","Demand Reduction and Operational","Promote modal options and operate","Promote modal options and operate","Partial Construction",null,1,1,1,0,0,0,0,0,"M","L","L","L","H","L","H","H","H","H","H","H","L","H","H","H","H","H","Low","High","High"]
[23,"52.1","SS 280","IH 35W","IH 30","Continue to Monitor","Promote options, may need roadway capacity","Continue to Monitor","Continue to Monitor",null,0,0,0,0,0,0,0,0,"L","L","L","L","H","L","L","M","H","H","H","L","L","H","H","H","H","H","Low","Medium","Low"]
[24,"150.1","IH 820 (North)","SH 199","IH 35W","Continue to Monitor","Operate and may need options","Continue to Monitor","Continue to Monitor",null,0,0,0,0,0,0,0,0,"L","M","L","L","H","L","L","M","L","H","H","L","H","H","H","H","H","L","Low","Low","Medium"]
[25,"1.5","US 287","IH 35W","IH 820 (East)","Continue to Monitor","Promote options, may need roadway capacity","Continue to Monitor","Continue to Monitor",null,0,0,0,0,0,0,0,0,"L","H","L","L","H","L","L","M","H","H","H","L","L","H","H","H","H","H","Low","Medium","Low"]
[26,"151.3","IH 820 (East)","IH 30 ","US 287","Operational","Needs Help","Implement operational strategies","Full Construction",null,1,0,0,0,0,0,0,0,"M","H","L","L","L","L","L","H","M","M","H","L","L","H","H","H","H","H","Low","Low","Low"]
[27,"151.4","IH 820 (East)","US 287","IH 20","Demand Reduction","Promote alternate routes, need modal options and operations","Needs Corridor Study","Full Construction",null,0,1,0,0,0,0,0,0,"L","H","H","L","L","L","L","H","L","H","H","L","L","H","H","H","H","M","High","Low","Low"]
[28,"151.2","IH 820 (East)","SH 121","IH 30","Continue to Monitor","Needs Help","Continue to Monitor","Partial Construction",null,0,0,0,0,0,0,0,0,"L","M","L","L","H","L","L","M","L","H","M","L","L","H","H","H","H","L","Low","Low","Low"]
[29,"151.1","IH 820 (East)","SH 183","SH 121","Demand Reduction and Operational","Needs Help","Needs Corridor Study","Full Construction",null,1,1,1,0,0,0,0,0,"L","H","L","L","H","L","L","H","L","H","H","L","L","H","H","H","H","M","Low","Low","Low"]
[30,"11.9","SH 121","SH 183","IH 820 (East)","Continue to Monitor","Operate and may need options","Continue to Monitor","Continue to Monitor",null,0,0,0,0,0,0,0,0,"L","H","L","L","L","L","L","L","L","M","H","H","L","H","H","H","H","L","Low","Low","High"]
[31,"11.8","SH 121","SH 360","SH 183","Demand Reduction","Needs Help","Needs Corridor Study","Recent Construction",null,0,1,0,0,0,0,0,0,"L","H","L","L","L","L","L","L","L","M","H","L","L","H","H","H","H","L","Low","Low","Low"]
[32,"22.1","SH 183","SH 121","SH 360","Continue to Monitor","Operate and may need options","Continue to Monitor","Recent Construction",null,0,0,0,0,0,0,0,0,"M","H","L","L","H","L","M","L","L","H","H","H","L","H","H","H","H","L","Low","Low","High"]
[33,"9.1","SH 360","SH 121","SH 183","Continue to Monitor","Need modal options and operations","Continue to Monitor","Continue to Monitor",null,0,0,0,0,0,0,0,0,"L","H","M","L","H","L","L","L","M","H","H","L","L","H","H","H","H","L","Medium","Low","Low"]
[34,"22.2","SH 183","SH 360","PGBT","Demand Reduction and Operational","Promote modal options and operate","Promote modal options and operate","Recent Construction",null,0,1,1,0,0,0,0,0,"L","M","L","L","H","L","H","H","H","H","H","H","L","H","H","H","H","H","Low","High","High"]
[35,"13.1","International Parkway","SH 114","SH 183","Continue to Monitor","Promote options and needs operations","Continue to Monitor","Continue to Monitor",null,0,0,0,0,0,0,0,0,"L","L","H","L","H","L","L","H","H","H","L","L","L","H","H","H","H","H","High","Medium","Low"]
[36,"11.7","SH 121","SH 114","SH 360  ","Continue to Monitor","Needs Help","Continue to Monitor","Continue to Monitor",null,0,0,0,0,0,0,0,0,"L","H","L","L","H","L","L","L","L","H","H","L","L","H","H","H","H","L","Low","Low","Low"]
[37,"12.4","SH 114","SH 121","International Parkway/DFW Connector","Continue to Monitor","Operate and may need options","Continue to Monitor","Continue to Monitor",null,0,0,0,0,0,0,0,0,"L","M","L","L","H","L","L","M","M","H","H","H","L","H","H","H","H","M","Low","Low","High"]
[38,"12.5","SH 114","International Parkway","PGBT (West)","Demand Reduction and Operational","Promote options and operate","Promote options and operate","CMP Strategy",null,0,0,1,0,0,0,0,0,"L","M","H","L","H","H","L","H","H","M","H","H","L","H","H","H","H","H","High","High","High"]
[39,"123.1","PGBT (West)","SL 12","IH 635 (North)","Demand Reduction and Operational","Needs Help","Needs Corridor Study","Full Construction",null,0,0,1,0,0,0,0,0,"L","H","L","L","H","L","L","L","M","H","H","L","L","H","H","H","H","L","Low","Low","Low"]
[40,"15.1","PGBT/SH 161","SH 114","SH 183","Continue to Monitor","Promote options, may need roadway capacity","Continue to Monitor","Full Construction",null,0,0,0,0,0,0,0,0,"L","H","L","L","H","L","L","M","H","M","H","L","L","H","H","H","H","H","Low","Medium","Low"]
[41,"130.1","IH 635 (North)","SH 121","PGBT (West)","Demand Reduction and Operational","Promote alternate routes, need modal options and operations","Promote alternate routes","Partial Construction",null,0,0,1,0,0,0,0,0,"M","L","H","L","H","M","L","M","L","H","H","L","L","H","H","H","H","L","High","Low","Low"]
[42,"130.2","IH 635 (North)","PGBT (West)","IH 35E","Continue to Monitor","Promote options and needs operations","Continue to Monitor","Continue to Monitor",null,0,0,0,0,0,0,0,0,"L","M","H","L","H","L","L","H","H","H","H","L","L","H","H","H","H","H","High","Medium","Low"]
[43,"123.2","PGBT (West)","IH 635 (North)","IH 35E","Continue to Monitor","Operate and may need options","Continue to Monitor","Full Construction",null,0,0,0,0,0,0,0,0,"L","L","L","L","H","L","L","L","L","L","H","L","L","H","H","H","H","L","Low","Low","Medium"]
[44,"7.3","IH 35E","PGBT","IH 635 (North)","Demand Reduction and Operational","Promote options and operate","Promote options and operate","Full Construction",null,1,1,0,0,0,0,0,0,"L","H","H","L","H","H","L","M","M","M","H","H","L","H","H","H","H","M","High","High","High"]
[45,"7.2","IH 35E","SRT","PGBT","Operational","Promote modal options and operate","Promote modal options and operate","Full Construction",null,1,0,0,0,0,0,0,0,"L","H","L","L","H","L","H","L","L","H","H","H","L","H","H","H","H","L","Low","High","High"]
[46,"11.6","SH 121","IH 635 (North)","SH 114","Continue to Monitor","Promote options, may need roadway capacity","Continue to Monitor","Continue to Monitor",null,0,0,0,0,0,0,0,0,"L","L","L","L","H","L","L","H","M","H","H","L","L","H","H","H","H","H","Low","Medium","Low"]
[47,"5.2","IH 35W","SH 114","US 287","Demand Reduction","Needs Help","Needs Corridor Study","Partial Construction",null,0,1,0,0,0,0,0,0,"L","H","L","L","L","L","L","H","L","L","M","L","L","H","H","H","H","M","Low","Low","Low"]
[48,"130.3","IH 635 (North)","IH 35E","DNT","Continue to Monitor","Promote options and operate","Continue to Monitor","Continue to Monitor",null,0,0,0,0,0,0,0,0,"L","H","M","L","H","L","L","H","H","L","M","H","L","H","H","H","H","H","Medium","Medium","High"]
[49,"120.1","PGBT (North)","IH 35E","DNT","Demand Reduction and Operational","Promote alternate routes and operate",{"$error":"#N/A"},"Recent Construction",null,1,0,1,0,0,0,0,0,"L","M","H","L","H","L","L","M","L","L","H","L","L","H","H","H","H","L","High","Low","Medium"]
[50,"23.3","US 75","SH 121","SRT","Continue to Monitor","Needs Help","Continue to Monitor","Continue to Monitor",null,0,0,0,0,0,0,0,0,"M","H","L","L","L","L","L","L","L","H","H","L","L","H","H","H","H","L","Low","Low","Low"]
[51,"23.2","US 75","Collin Co. Outer Loop","SH 121","Continue to Monitor","Need modal options and operations","Continue to Monitor","Continue to Monitor",null,0,0,0,0,0,0,0,0,"H","H","L","L","L","L","L","L","L","H","H","L","L","H","H","H","H","L","Medium","Low","Low"]
[52,"23.1","US 75","Collin C/L","Collin Co. Outer Loop","Continue to Monitor","Needs Help","Continue to Monitor","Continue to Monitor",null,0,0,0,0,0,0,0,0,"M","H","L","L","L","L","L","L","L","H","M","L","L","H","H","H","H","L","Low","Low","Low"]
[53,"131.2","IH 635 (East)","IH 30","US 80","Demand Reduction and Operational","Operate and may need options","Promote trip reduction strategies and optimize existing operations","CMP Strategy",null,0,1,1,0,0,0,0,0,"M","H","L","L","L","L","L","L","L","H","H","L","H","H","H","H","H","L","Low","Low","Medium"]
[54,"32.1","US 80","IH 30","IH 635 (East)","Continue to Monitor","Need modal options and operations","Continue to Monitor","Continue to Monitor",null,0,0,0,0,0,0,0,0,"H","H","L","L","L","L","L","H","H","M","H","L","L","H","H","H","H","H","Medium","Low","Low"]
[55,"32.2","US 80","IH 635 (East)","IH 20","Rehab","Needs Help","Rehab Only","Rehab",null,0,0,0,0,0,0,1,0,"L","M","L","L","L","L","L","L","L","M","H","L","L","H","H","H","H","L","Low","Low","Low"]
[56,"131.3","IH 635 (East)","US 80","IH 20","Continue to Monitor","Operate and may need options","Continue to Monitor","Continue to Monitor",null,0,0,0,0,0,0,0,0,"M","L","L","L","L","L","L","M","L","H","H","L","H","H","H","H","H","L","Low","Low","Medium"]
[57,"30.14","IH 20","US 175","IH 635 (East)","Operational","Needs Help","Implement operational strategies","CMP Strategy",null,1,0,0,0,0,0,0,0,"M","L","L","L","L","L","L","L","L","H","H","L","L","H","H","H","H","L","Low","Low","Low"]
[58,"30.15","IH 20","IH 635 (East)","US 80","Continue to Monitor","Needs Help","Continue to Monitor","Continue to Monitor",null,0,0,0,0,0,0,0,0,"L","L","L","L","L","L","L","L","L","H","M","L","L","H","H","H","H","L","Low","Low","Low"]
[59,"30.13","IH 20","IH 45","US 175","Continue to Monitor","Needs Help","Continue to Monitor","Continue to Monitor",null,0,0,0,0,0,0,0,0,"L","L","L","L","L","L","L","L","L","H","H","L","L","H","H","H","H","L","Low","Low","Low"]
[60,"30.11","IH 20","US 67","IH 35E","Operational","Promote alternate routes and operate, may need modal options","Optimize existing operations","CMP Strategy",null,1,0,0,0,0,0,0,0,"H","H","L","L","L","L","L","H","H","H","H","L","H","H","H","H","H","H","Medium","Low","Medium"]
[61,"30.9","IH 20","PGBT","SL 12","Demand Reduction and Operational","Operate and may need options","Promote trip reduction strategies and optimize existing operations","Partial Construction",null,0,0,1,0,0,0,0,0,"L","L","L","L","L","L","L","L","L","H","H","L","H","H","H","H","H","L","Low","Low","Medium"]
[62,"30.8","IH 20","SH 360","PGBT","Demand Reduction and Operational","Operate and may need options","Promote trip reduction strategies and optimize existing operations","CMP Strategy",null,0,1,1,0,0,0,0,0,"M","H","L","L","L","L","L","L","L","H","H","L","H","H","H","H","H","L","Low","Low","Medium"]
[63,"30.6","IH 20","IH 820 (East)","US 287","Continue to Monitor","Operate and may need options","Continue to Monitor","Partial Construction",null,0,0,0,0,0,0,0,0,"L","H","L","L","L","L","L","H","L","H","H","L","H","H","H","H","H","M","Low","Low","Medium"]
[64,"1.6","US 287","IH 20","SH 360 Toll","Continue to Monitor","Needs Help","Continue to Monitor","Continue to Monitor",null,0,0,0,0,0,0,0,0,"L","M","L","L","L","L","L","L","L","L","M","L","L","H","H","H","H","L","Low","Low","Low"]
[65,"9.4","SH 360 (Toll)","IH 20 ","US 287","Operational","Operate and may need options","Impletment operational strategies","Recent Construction",null,1,0,0,0,0,0,0,0,"M","H","L","L","L","L","L","L","L","L","H","L","L","H","H","H","H","L","Low","Low","Medium"]
[66,"9.3","SH 360","IH 30","IH 20","Rehab","Promote alternate routes and operate","Rehab Only","Full Construction",null,0,0,0,0,1,0,0,0,"M","H","H","L","H","L","L","L","L","H","H","L","H","H","H","H","H","L","High","Low","Medium"]
[67,"15.3","PGBT (West)","IH 30","IH 20","Operational","Promote alternate routes and operate","Promote options and operate","Full Construction",null,1,0,0,0,0,0,0,0,"H","H","H","L","L","L","L","L","L","L","H","L","L","H","H","H","H","L","High","Low","Medium"]
[68,"17.3","SL 12","IH 30","IH 20","Rehab","Needs Help","Rehab Only","Rehab",null,0,0,0,0,1,0,0,0,"L","L","L","L","L","L","L","H","M","M","H","L","L","H","H","H","H","H","Low","Low","Low"]
[69,"38.1","US 67","IH 35E","IH 20","Rehab, Demand Reduction and Operational","Promote options and operate","Promote options and operate","Full Construction",null,0,0,1,0,1,0,0,0,"L","H","M","L","H","L","L","H","H","L","H","L","L","H","H","H","H","H","Medium","Medium","Medium"]
[70,"7.9","IH 35E","US 67","IH 20","Continue to Monitor","Promote options and operate","Continue to Monitor","Continue to Monitor",null,0,0,0,0,0,0,0,0,"H","H","H","L","H","M","L","H","H","H","H","L","H","H","H","H","H","H","High","Medium","Medium"]
[71,"28.4","IH 30","IH 820 (East)","SH 360 ","Demand Reduction and Operational","Needs Help","Needs Corridor Study","Partial Construction",null,0,0,1,0,0,0,0,0,"H","L","L","L","H","L","L","L","L","H","H","L","L","H","H","H","H","L","Low","Low","Low"]
[72,"28.5","IH 30","SH 360","PGBT","Demand Reduction","Needs Help","Needs Corridor Study","Full Construction",null,0,1,0,0,0,0,0,0,"H","M","L","L","H","L","L","L","L","H","H","L","L","H","H","H","H","L","Low","Low","Low"]
[73,"28.6","IH 30","PGBT","SL 12","Continue to Monitor","Operate and may need options","Continue to Monitor","Partial Construction",null,0,0,0,0,0,0,0,0,"M","M","L","L","H","L","L","L","L","L","H","H","H","H","H","H","H","L","Low","Low","High"]
[74,"9.2","SH 360","SH 183","IH 30","Demand Reduction","Promote alternate routes and operate","Promote trip reduction strategies and optimize existing operations","Full Construction",null,0,1,0,0,0,0,0,0,"L","M","H","L","H","L","L","L","L","H","H","L","H","H","H","H","H","L","High","Low","Medium"]
[75,"15.2","PGBT (West)","SH 183","IH 30","Demand Reduction and Operational","Promote alternate routes and operate",{"$error":"#N/A"},"Full Construction",null,0,0,1,0,0,0,0,0,"L","M","H","L","H","L","L","L","L","L","H","L","L","H","H","H","H","L","High","Low","Medium"]
[76,"17.2","SL 12","SH 183","IH 30","Rehab and Demand Reduction","Promote options, may need roadway capacity","Promote modal options and implement operational strategies","Partial Construction",null,0,1,0,0,1,0,0,0,"L","H","L","L","H","L","L","H","M","M","H","L","H","H","H","H","H","H","Low","Medium","Low"]
[77,"22.3","SH 183","PGBT","SL 12","Continue to Monitor","Promote options and operate","Continue to Monitor","Recent Construction",null,0,0,0,0,0,0,0,0,"M","H","M","L","H","L","H","H","H","H","H","H","L","H","H","H","H","H","Medium","High","High"]
[78,"7.4","IH 35E","IH 635 (North)","SL 12","Operational","Promote modal options and operate","Promote modal options and operate","CMP Strategy",null,1,0,0,0,0,0,0,0,"L","L","L","L","H","H","L","H","H","M","H","H","L","H","H","H","H","H","Low","High","High"]
[79,"31.2","CTP ","IH 20 ","US 67","Continue to Monitor","Operate and may need options","Continue to Monitor","Continue to Monitor",null,0,0,0,0,0,0,0,0,"H","L","L","L","H","L","L","L","L","L","H","L","L","H","H","H","H","L","Low","Low","Medium"]
[80,"5.9","IH 35W","Tarrant C/L","FM 917","Continue to Monitor","Needs Help","Continue to Monitor","Full Construction",null,0,0,0,0,0,0,0,0,"L","H","L","L","H","L","L","L","L","L","L","L","L","H","H","H","H","L","Low","Low","Low"]
[81,"27.3","IH 45","IH 20","SL 9","Continue to Monitor","Needs Help","Continue to Monitor","Continue to Monitor",null,0,0,0,0,0,0,0,0,"L","H","L","L","L","L","L","L","L","H","L","L","H","H","H","H","H","L","Low","Low","Low"]
[82,"36.3","US 175","IH 20 ","SH 34","Continue to Monitor","Needs Help","Continue to Monitor","Continue to Monitor",null,0,0,0,0,0,0,0,0,"L","M","L","L","L","L","L","L","L","H","L","L","L","H","H","H","H","L","Low","Low","Low"]
[83,"30.16","IH 20","US 80","Kaufman C/L","Continue to Monitor","Needs Help","Continue to Monitor","Continue to Monitor",null,0,0,0,0,0,0,0,0,"L","L","L","L","L","L","L","L","L","L","M","L","L","H","H","H","H","L","Low","Low","Low"]
[84,"23.6","US 75","IH 635 (North)","SS 366","Demand Reduction and Operational","Promote options","Promote alternate routes and modal options","CMP Strategy",null,0,1,1,0,0,0,0,0,"M","H","H","L","H","H","L","H","H","M","H","L","L","H","H","H","H","H","High","High","Low"]
[85,"7.5","IH 35E","SL 12","SH 183","Demand Reduction and Operational","Promote modal options and needs operations","Promote modal options","Full Construction",null,0,1,1,0,0,0,0,0,"L","L","L","L","H","H","L","H","H","H","H","L","L","H","H","H","H","H","Low","High","Low"]
[86,"42.1","SS 482","SH 183","IH 35E","Rehab","Promote options, may need roadway capacity","Rehab Only","Rehab",null,0,0,0,0,1,0,0,0,"L","L","M","L","H","M","L","H","H","H","M","L","L","H","H","H","H","H","Low","Medium","Low"]
[87,"17.1","SL 12","IH 35E","SH 183","Rehab, Demand Reduction and Operational","Promote alternate routes and operate","Needs Corridor Study","Full Construction",null,0,1,1,0,1,0,0,0,"L","H","H","L","H","L","L","L","H","H","H","H","L","H","H","H","H","M","High","Low","High"]
[88,"22.4","SH 183","SL 12","SH 114","Continue to Monitor","Promote options and operate","Continue to Monitor","Full Construction",null,0,0,0,0,0,0,0,0,"H","H","H","L","H","H","M","H","H","H","H","H","L","H","H","H","H","H","High","High","High"]
[89,"44.1","SS 366","IH 35E","US 75","Rebuild with Capacity","Promote options and needs operations","Promote alternate routes and modal options, implement operational strategies","CMP Strategy",null,1,1,1,0,1,0,0,0,"H","H","H","L","H","L","L","H","H","H","H","L","L","H","H","H","H","H","High","Medium","Low"]
[90,"25.1","IH 345","SS 366","IH 30","Rehab and Demand Reduction","Promote modal options and needs operations","Promote modal options","CMP Strategy",null,0,1,0,0,0,0,1,0,"H","L","L","L","H","H","H","H","H","M","H","L","L","H","H","H","H","H","Low","High","Low"]
[91,"7.7","IH 35E","DNT","IH 30","Demand Reduction and Operational","Promote modal options and operate","Promote modal options and operate","Partial Construction",null,1,1,0,0,0,0,0,0,"M","M","L","L","H","H","H","H","H","L","H","L","L","H","H","H","H","H","Low","High","Medium"]
[92,"36.1","US 175","IH 45","IH 20","Continue to Monitor","Promote options, may need roadway capacity","Continue to Monitor","Partial Construction",null,0,0,0,0,0,0,0,0,"L","M","L","L","H","L","L","M","H","L","H","L","H","H","H","H","H","H","Low","Medium","Low"]
[93,"27.2","IH 45","US 175","IH 20","Continue to Monitor","Promote modal options and operate","Continue to Monitor","Continue to Monitor",null,0,0,0,0,0,0,0,0,"M","L","M","L","H","L","L","M","H","H","H","L","H","H","H","H","H","H","Low","Medium","Medium"]
[94,"27.1","IH 45","IH 30","US 175","Demand Reduction and Operational","Promote modal options and operate","Promote modal options and operate","CMP Strategy",null,1,1,0,0,0,0,0,0,"H","L","L","L","H","H","L","M","H","H","H","L","H","H","H","H","H","H","Low","High","Medium"]
[95,"28.8","IH 30 \"Horseshoe\"","IH 35E","IH 35E","Rebuild with Capacity","Promote modal options and needs operations","Promote modal options","Recent Construction",null,1,1,1,0,0,0,1,0,"H","M","L","L","H","H","L","H","H","H","H","L","L","H","H","H","H","H","Low","High","Low"]
[96,"7.8","IH 35E","IH 30","US 67","Rehab and Operational","Promote modal options and needs operations","Impletment operational strategies","Full Construction",null,1,0,0,0,0,0,1,0,"L","L","L","L","H","H","L","H","H","M","H","L","H","H","H","H","H","H","Low","High","Low"]
[97,"28.9","IH 30","IH 35E","IH 45","Demand Reduction and Operational","Promote options and operate","Promote options and operate","Full Construction",null,1,1,0,0,0,0,0,0,"H","L","H","L","H","H","L","H","H","L","H","L","L","H","H","H","H","H","High","High","Medium"]
[98,"28.7","IH 30","SL 12","IH 35E","Continue to Monitor","Promote modal options and operate","Continue to Monitor","Partial Construction",null,0,0,0,0,0,0,0,0,"M","M","L","L","H","L","L","H","H","L","H","H","L","H","H","H","H","H","Low","Medium","High"]
[99,"21.3","DNT ","PGBT (North)","IH 635 (North)","Demand Reduction and Operational","Promote options and operate","Promote options and operate","CMP Strategy",null,1,1,1,0,0,0,0,0,"L","H","M","L","H","L","L","H","H","L","H","L","L","H","H","H","H","H","Medium","Medium","Medium"]
[100,"23.5","US 75","PGBT","IH 635 (North)","Rehab, Demand Reduction and Operational","Promote modal options and needs operations","Promote modal options and implement operational strategies","CMP Strategy",null,0,1,1,0,1,0,0,0,"L","H","L","H","H","H","L","M","H","M","H","L","H","H","H","H","H","H","Low","High","Low"]
[101,"14.2","SH 199","Tarrant C/L","IH 820 (North)","Operational","Needs Help","Implement operational strategies","Recent Construction",null,1,0,0,0,0,0,0,0,"L","H","L","L","L","L","L","L","L","L","M","L","L","H","H","H","H","L","Low","Low","Low"]
[102,"153.2","IH 820 (West)","IH 30 ","SH 199","Continue to Monitor","Operate and may need options","Continue to Monitor","Continue to Monitor",null,0,0,0,0,0,0,0,0,"L","H","L","L","H","L","L","L","L","H","H","L","H","H","H","H","H","L","Low","Low","Medium"]
[103,"153.1","IH 820 (West)","IH 20","IH 30","Continue to Monitor","Promote alternate routes and operate, may need modal options","Continue to Monitor","Continue to Monitor",null,0,0,0,0,0,0,0,0,"H","H","L","L","H","L","L","L","L","H","H","L","H","H","H","H","H","L","Medium","Low","Medium"]
[104,"5.7","IH 35W","IH 30","IH 20","Continue to Monitor","Promote options and operate","Continue to Monitor","Continue to Monitor",null,0,0,0,0,0,0,0,0,"M","H","M","L","H","L","L","H","H","H","H","L","H","H","H","H","H","H","Medium","Medium","Medium"]
[105,"5.8","IH 35W","IH 20","Tarrant C/L","Continue to Monitor","Operate and may need options","Continue to Monitor","Continue to Monitor",null,0,0,0,0,0,0,0,0,"L","H","L","L","H","L","L","H","L","H","H","L","H","H","H","H","H","M","Low","Low","Medium"]
[106,"5.5","IH 35W","IH 820 (North)","SH 121","Demand Reduction and Operational","Promote modal options and operate","Promote modal options and operate","Partial Construction",null,1,1,0,0,0,0,0,0,"L","M","L","L","H","L","L","H","H","M","M","H","L","H","H","H","H","H","Low","Medium","High"]
[107,"11.10","SH 121","IH 820 (East)","IH 35W","Continue to Monitor","Promote modal options and needs operations","Continue to Monitor","Partial Construction",null,0,0,0,0,0,0,0,0,"L","H","L","L","H","L","H","L","H","M","H","L","L","H","H","H","H","M","Low","High","Low"]
[108,"1.4","US 287","Tarrant C/L","IH 35W","Continue to Monitor","Needs Help","Continue to Monitor","Partial Construction",null,0,0,0,0,0,0,0,0,"L","L","L","L","L","L","L","L","L","M","L","L","L","H","H","H","H","L","Low","Low","Low"]
[109,"5.4","IH 35W","US 287","IH 820 (North)","Demand Reduction and Operational","Needs Help","Needs Corridor Study","Partial Construction",null,1,0,1,0,0,0,0,0,"L","M","L","L","H","L","L","H","L","H","L","M","L","H","H","H","H","M","Low","Low","Low"]
[110,"150.2","IH 820 (North)","IH 35W","SH 183","Continue to Monitor","Operate and may need options","Continue to Monitor","Continue to Monitor",null,0,0,0,0,0,0,0,0,"M","M","L","L","H","L","L","L","L","L","M","H","L","H","H","H","H","L","Low","Low","High"]
[111,"7.1","IH 35E","IH 35W","SRT","Operational","Promote modal options and operate","Promote modal options and operate","CMP Strategy",null,1,0,0,0,0,0,0,0,"L","H","L","L","H","L","H","M","L","M","H","M","L","H","H","H","H","L","Low","High","High"]
[112,"11.5","SH 121","IH 35E","IH 635 (North)","Rehab, Demand Reduction and Operational","Needs Help","Needs Corridor Study","Partial Construction",null,0,0,1,0,1,0,0,0,"L","H","L","L","H","L","L","L","L","M","M","L","L","H","H","H","H","L","Low","Low","Low"]
[113,"12.3","SH 114","SH 170","SH 121","Continue to Monitor","Needs Help","Continue to Monitor","Partial Construction",null,0,0,0,0,0,0,0,0,"L","H","L","L","H","L","L","L","L","H","M","L","L","H","H","H","H","L","Low","Low","Low"]
[114,"30.7","IH 20","US 287","SH 360","Continue to Monitor","Operate and may need options","Continue to Monitor","Partial Construction",null,0,0,0,0,0,0,0,0,"M","M","L","L","H","L","L","H","L","H","H","L","H","H","H","H","H","M","Low","Low","Medium"]
[115,"38.2","US 67","IH 20","SH 360","Continue to Monitor","Needs Help","Continue to Monitor","Partial Construction",null,0,0,0,0,0,0,0,0,"L","H","L","L","L","L","L","L","L","L","L","L","L","H","H","H","H","L","Low","Low","Low"]
[116,"7.10","IH 35E","IH 20","US 77","Continue to Monitor","Needs Help","Continue to Monitor","Partial Construction",null,0,0,0,0,0,0,0,0,"L","H","L","L","H","L","L","L","L","H","H","L","L","H","H","H","H","L","Low","Low","Low"]
[117,"30.10","IH 20","SL 12","US 67","Continue to Monitor","Needs Help","Continue to Monitor","Partial Construction",null,0,0,0,0,0,0,0,0,"H","L","L","L","L","L","L","L","M","L","H","L","H","H","H","H","H","L","Low","Low","Low"]
[118,"7.6","IH 35E","SH 183","DNT","Demand Reduction and Operational","Promote modal options and needs operations","Promote modal options","Full Construction",null,0,1,1,0,0,0,0,0,"L","H","L","L","H","M","H","H","H","H","H","L","L","H","H","H","H","H","Low","High","Low"]
[119,"22.5","SH 183","SH 114","IH 35E","Demand Reduction","Promote modal options and operate","Promote modal options and operate","Full Construction",null,0,1,0,0,0,0,0,0,"L","H","L","L","H","M","L","H","H","M","H","M","L","H","H","H","H","H","Low","Medium","High"]
[120,"12.6","SH 114","PGBT (West)","SH 183","Continue to Monitor","Promote modal options and operate","Continue to Monitor","Partial Construction",null,0,0,0,0,0,0,0,0,"L","H","L","L","H","M","L","M","H","L","H","H","L","H","H","H","H","H","Low","Medium","High"]
[121,"11.3","SRT","US 75","DNT","Continue to Monitor","Operate and may need options","Continue to Monitor","Full Construction",null,0,0,0,0,0,0,0,0,"L","H","L","L","L","L","L","L","L","L","H","L","L","H","H","H","H","L","Low","Low","Medium"]
[122,"23.4","US 75","SRT","PGBT","Continue to Monitor","Needs Help","Continue to Monitor","Continue to Monitor",null,0,0,0,0,0,0,0,0,"L","H","L","M","H","L","L","L","L","L","H","L","H","H","H","H","H","L","Low","Low","Low"]
[123,"21.4","DNT","IH 635 (North)","IH 35E","Demand Reduction and Operational","Promote options and operate","Promote options and operate","CMP Strategy",null,0,0,1,0,0,0,0,0,"M","L","H","L","H","L","L","H","H","L","H","L","L","H","H","H","H","H","High","Medium","Medium"]
[124,"30.12","IH 20","IH 35E","IH 45","Continue to Monitor","Operate and may need options","Continue to Monitor","Continue to Monitor",null,0,0,0,0,0,0,0,0,"M","H","L","L","L","L","L","H","M","H","H","L","H","H","H","H","H","H","Low","Low","Medium"]
[125,"28.14","IH 30","Rockwall C/L","SS 302","Continue to Monitor","Needs Help","Continue to Monitor","Partial Construction",null,0,0,0,0,0,0,0,0,"L","H","L","L","L","L","L","L","L","L","L","L","L","H","H","H","H","L","Low","Low","Low"]
[126,"28.10","IH 30","IH 45","US 80","Demand Reduction and Operational","Promote modal options and operate","Promote modal options and operate","CMP Strategy",null,1,1,0,0,0,0,0,0,"M","L","L","H","H","L","L","H","H","L","H","L","L","H","H","H","H","H","Low","Medium","Medium"]

{"sheet":"Ref7","index":11,"n_rows":51,"n_cols":129,"rows_kept":51,"cut":false,"hidden":true,"merged":[]}
["OBJECTID","MAX","OBJECTID",108,25,64,1,2,47,109,106,22,104,105,80,111,116,45,44,78,85,118,91,96,70,33,74,66,65,107,121,5,112,46,36,31,30,113,37,38,120,35,101,40,75,67,87,76,68,3,4,99,123,32,34,77,88,119,52,51,50,122,100,84,90,94,93,81,17,126,10,11,12,125,15,21,71,72,73,98,95,97,13,117,60,124,59,57,58,83,16,18,19,20,63,114,62,61,14,79,54,55,92,82,69,115,86,89,23,49,6,7,39,43,41,42,48,8,9,53,56,24,110,29,28,26,27,103,102]
["CMP2019",null,"CMP2019",1.4,1.5,1.6,3.1,5.0999999999999996,5.2,5.4,5.5,5.6,5.7,5.8,5.9,7.1,7.1,7.2,7.3,7.4,7.5,7.6,7.7,7.8,7.9,9.1,9.1999999999999993,9.3000000000000007,9.4,11.1,11.3,11.4,11.5,11.6,11.7,11.8,11.9,12.3,12.4,12.5,12.6,13.1,14.2,15.1,15.2,15.3,17.100000000000001,17.2,17.3,21.1,21.2,21.3,21.4,22.1,22.2,22.3,22.4,22.5,23.1,23.2,23.3,23.4,23.5,23.6,25.1,27.1,27.2,27.3,28.1,28.1,28.11,28.12,28.13,28.14,28.2,28.3,28.4,28.5,28.6,28.7,28.8,28.9,30.1,30.1,30.11,30.12,30.13,30.14,30.15,30.16,30.2,30.3,30.4,30.5,30.6,30.7,30.8,30.9,31.1,31.2,32.1,32.200000000000003,36.1,36.299999999999997,38.1,38.200000000000003,42.1,44.1,52.1,120.1,120.2,121.1,123.1,123.2,130.1,130.19999999999999,130.30000000000001,130.4,131.1,131.19999999999999,131.30000000000001,150.1,150.19999999999999,151.1,151.19999999999999,151.30000000000001,151.4,153.1,153.19999999999999]
["Facility",null,"Facility","US 287","US 287","US 287","IH 35","IH 35W","IH 35W","IH 35W","IH 35W","IH 35W","IH 35W","IH 35W","IH 35W","IH 35E","IH 35E","IH 35E","IH 35E","IH 35E","IH 35E","IH 35E","IH 35E","IH 35E","IH 35E","SH 360","SH 360","SH 360","SH 360 (Toll)","SH 121","SRT","SRT","SH 121","SH 121","SH 121","SH 121","SH 121","SH 114","SH 114","SH 114","SH 114","International Parkway","SH 199","PGBT/SH 161","PGBT (West)","PGBT (West)","SL 12","SL 12","SL 12","DNT","DNT","DNT ","DNT","SH 183","SH 183","SH 183","SH 183","SH 183","US 75","US 75","US 75","US 75","US 75","US 75","IH 345","IH 45","IH 45","IH 45","IH 30","IH 30","IH 30","IH 30","IH 30","IH 30","IH 30","IH 30","IH 30","IH 30","IH 30","IH 30","IH 30 \"Horseshoe\"","IH 30","IH 20","IH 20","IH 20","IH 20","IH 20","IH 20","IH 20","IH 20","IH 20","IH 20","IH 20","IH 20","IH 20","IH 20","IH 20","IH 20","CTP","CTP ","US 80","US 80","US 175","US 175","US 67","US 67","SS 482","SS 366","SS 280","PGBT (North)","PGBT (North)","PGBT (East)","PGBT (West)","PGBT (West)","IH 635 (North)","IH 635 (North)","IH 635 (North)","IH 635 (North)","IH 635 (East)","IH 635 (East)","IH 635 (East)","IH 820 (North)","IH 820 (North)","IH 820 (East)","IH 820 (East)","IH 820 (East)","IH 820 (East)","IH 820 (West)","IH 820 (West)"]
["From_Facility",null,"From_Facility","Tarrant C/L","IH 35W","IH 20","Denton C/L","FM 917","SH 114","US 287","IH 820 (North)","SH 121","IH 30","IH 20","Tarrant C/L","IH 35W","IH 20","SRT","PGBT","IH 635 (North)","SL 12","SH 183","DNT","IH 30","US 67","SH 121","SH 183","IH 30","IH 20 ","IH 820 (East)","US 75","DNT","IH 35E","IH 635 (North)","SH 114","SH 360","SH 183","SH 170","SH 121","International Parkway","PGBT (West)","SH 114","Tarrant C/L","SH 114","SH 183","IH 30","IH 35E","SH 183","IH 30","S of US 380 (Freeway Lanes)","SRT","PGBT (North)","IH 635 (North)","SH 121","SH 360","PGBT","SL 12","SH 114","Collin C/L","Collin Co. Outer Loop","SH 121","SRT","PGBT","IH 635 (North)","SS 366","IH 30","US 175","IH 20","IH 20","IH 45","US 80","IH 635 (East)","PGBT","Rockwall C/L","IH 820 (West)","IH 35W","IH 820 (East)","SH 360","PGBT","SL 12","IH 35E","IH 35E","SS 312","SL 12","US 67","IH 35E","IH 45","US 175","IH 635 (East)","US 80","IH 30","IH 820 (West)","CTP","IH 35W","IH 820 (East)","US 287","SH 360","PGBT","IH 30","IH 20 ","IH 30","IH 635 (East)","IH 45","IH 20 ","IH 35E","IH 20","SH 183","IH 35E","IH 35W","IH 35E","DNT","US 75","SL 12","IH 635 (North)","SH 121","PGBT (West)","IH 35E","DNT","US 75","IH 30","US 80","SH 199","IH 35W","SH 183","SH 121","IH 30 ","US 287","IH 20","IH 30 "]
["To_Facility",null,"To_Facility","IH 35W","IH 820 (East)","SH 360 Toll","IH 35E/IH35W","US 67","US 287","IH 820 (North)","SH 121","IH 30","IH 20","Tarrant C/L","FM 917","SRT","US 77","PGBT","IH 635 (North)","SL 12","SH 183","DNT","IH 30","US 67","IH 20","SH 183","IH 30","IH 20","US 287","IH 35W","DNT","IH 35E","IH 635 (North)","SH 114","SH 360  ","SH 183","IH 820 (East)","SH 121","International Parkway/DFW Connector","PGBT (West)","SH 183","SH 183","IH 820 (North)","SH 183","IH 30","IH 20","SH 183","IH 30","IH 20","SRT","PGBT (North)","IH 635 (North)","IH 35E","SH 360","PGBT","SL 12","SH 114","IH 35E","Collin Co. Outer Loop","SH 121","SRT","PGBT","IH 635 (North)","SS 366","IH 30","US 175","IH 20","SL 9","IH 820 (West)","US 80","IH 635 (East)","PGBT","Rockwall C/L","SS 302","IH 35W","IH 820 (East)","SH 360 ","PGBT","SL 12","IH 35E","IH 35E","IH 45","IH 30","US 67","IH 35E","IH 45","US 175","IH 635 (East)","US 80","Kaufman C/L","IH 820 (West)","CTP","IH 35W","IH 820 (East)","US 287","SH 360","PGBT","SL 12","IH 20","US 67","IH 635 (East)","IH 20","IH 20","SH 34","IH 20","SH 360","IH 35E","US 75","IH 30","DNT","US 75","IH 30","IH 635 (North)","IH 35E","PGBT (West)","IH 35E","DNT","US 75","IH 30","US 80","IH 20","IH 35W","SH 183","SH 121","IH 30","US 287","IH 20","IH 30","SH 199"]
[null,null,"Statement","Partial Construction","Continue to Monitor","Continue to Monitor","Continue to Monitor","Partial Construction","Partial Construction","Partial Construction","Partial Construction","Partial Construction","Continue to Monitor","Continue to Monitor","Full Construction","CMP Strategy","Partial Construction","Full Construction","Full Construction","CMP Strategy","Full Construction","Full Construction","Partial Construction","Full Construction","Continue to Monitor","Continue to Monitor","Full Construction","Full Construction","Recent Construction","Partial Construction","Full Construction","Full Construction","Partial Construction","Continue to Monitor","Continue to Monitor","Full Construction","Continue to Monitor","Partial Construction","Continue to Monitor","CMP Strategy","Partial Construction","Continue to Monitor","Full Construction","Full Construction","Full Construction","Full Construction","Full Construction","Partial Construction","Rehab","Partial Construction","Corridor Study","CMP Strategy","CMP Strategy","Partial Construction","Recent Construction","Recent Construction","Full Construction","Full Construction","Continue to Monitor","Continue to Monitor","Continue to Monitor","Continue to Monitor","CMP Strategy","CMP Strategy","CMP Strategy","CMP Strategy","Continue to Monitor","Continue to Monitor","Continue to Monitor","CMP Strategy","Continue to Monitor","Corridor Study","Partial Construction","Partial Construction","Continue to Monitor","Continue to Monitor","Partial Construction","Full Construction","Partial Construction","Partial Construction","Recent Construction","Full Construction","Partial Construction","Partial Construction","CMP Strategy","Continue to Monitor","Continue to Monitor","CMP Strategy","Continue to Monitor","Continue to Monitor","Continue to Monitor","Continue to Monitor","Continue to Monitor","Continue to Monitor","Partial Construction","Partial Construction","CMP Strategy","Partial Construction","Continue to Monitor","Continue to Monitor","Continue to Monitor","Rehab","Partial Construction","Continue to Monitor","Full Construction","Partial Construction","Rehab","CMP Strategy","Continue to Monitor","Recent Construction","Continue to Monitor","Continue to Monitor","Full Construction","Full Construction","Partial Construction","Continue to Monitor","Continue to Monitor","Continue to Monitor","Full Construction","CMP Strategy","Continue to Monitor","Continue to Monitor","Continue to Monitor","Full Construction","Partial Construction","Full Construction","Full Construction","Continue to Monitor","Continue to Monitor"]
["CMP2019","Column1","CMP20192","1.4","1.5","1.6","3.1","5.1","5.2","5.4","5.5","5.6","5.7","5.8","5.9","7.1","7.10","7.2","7.3","7.4","7.5","7.6","7.7","7.8","7.9","9.1","9.2","9.3","9.4","11.10","11.3","11.4","11.5","11.6","11.7","11.8","11.9","12.3","12.4","12.5","12.6","13.1","14.2","15.1","15.2","15.3","17.1","17.2","17.3","21.1","21.2","21.3","21.4","22.1","22.2","22.3","22.4","22.5","23.1","23.2","23.3","23.4","23.5","23.6","25.1","27.1","27.2","27.3","28.1","28.10","28.11","28.12","28.13","28.14","28.2","28.3","28.4","28.5","28.6","28.7","28.8","28.9","30.1","30.10","30.11","30.12","30.13","30.14","30.15","30.16","30.2","30.3","30.4","30.5","30.6","30.7","30.8","30.9","31.1","31.2","32.1","32.2","36.1","36.3","38.1","38.2","42.1","44.1","52.1","120.1","120.2","121.1","123.1","123.2","130.1","130.2","130.3","130.4","131.1","131.2","131.3","150.1","150.2","151.1","151.2","151.3","151.4","153.1","153.2"]
["Commuter Transportation Options",1.5,"Bike Share",0,0.16666666666666666,0,0,0.16666666666666666,0.16666666666666666,0.16666666666666666,0.33333333333333331,0.33333333333333331,0.33333333333333331,0.16666666666666666,0,0,0,0,0,0.33333333333333331,0.33333333333333331,0.33333333333333331,0.33333333333333331,0.33333333333333331,1,0,0,0,0,0.16666666666666666,0,0,0,0.16666666666666666,0,0,0,0,0,0.33333333333333331,0.16666666666666666,0.33333333333333331,0,0.16666666666666666,0,0.66666666666666663,0.16666666666666666,0.16666666666666666,0.16666666666666666,0.66666666666666663,0.16666666666666666,0.33333333333333331,0.33333333333333331,0,0.33333333333333331,0.33333333333333331,1,0.33333333333333331,0,0.66666666666666663,0,0,0.16666666666666666,0.33333333333333331,1,0.83333333333333337,0.16666666666666666,0,0,0.33333333333333331,0.33333333333333331,0.16666666666666666,0,0,0.33333333333333331,1,0.66666666666666663,0.66666666666666663,0,0.33333333333333331,1,1,0,0.66666666666666663,1,0.16666666666666666,0,0,0,0,0,0,0.16666666666666666,0.16666666666666666,0.16666666666666666,0.16666666666666666,0,0,0.16666666666666666,0.66666666666666663,1,0,0.16666666666666666,0,0.33333333333333331,0,0.33333333333333331,1,0.16666666666666666,0,0.33333333333333331,0,0,0,0,0.33333333333333331,0.33333333333333331,0.33333333333333331,0.16666666666666666,0,0,0,0,0.16666666666666666,0,0.16666666666666666,0.16666666666666666,0.66666666666666663,0]
[null,3,"Bike/Transit Integration",0,0.33333333333333331,0,0,0,0,0,0.33333333333333331,0.66666666666666663,0.33333333333333331,0,0,0.33333333333333331,0,0.33333333333333331,0.33333333333333331,0.66666666666666663,0.66666666666666663,0.66666666666666663,1,0.66666666666666663,0.33333333333333331,0,0,0,0,0.33333333333333331,0,0,0,0.33333333333333331,0,0,0,0,0,0.66666666666666663,0.33333333333333331,0.33333333333333331,0,0.33333333333333331,0,0,0,0.33333333333333331,0.33333333333333331,0,0,0.33333333333333331,0.33333333333333331,0,0.66666666666666663,0.66666666666666663,0.66666666666666663,0.33333333333333331,0,0,0,0,0.66666666666666663,0.66666666666666663,1,0.66666666666666663,0.33333333333333331,0,0,0.33333333333333331,0.33333333333333331,0,0,0,0.33333333333333331,0.66666666666666663,0,0,0,0.33333333333333331,0.66666666666666663,0.66666666666666663,0,0,0.33333333333333331,0.33333333333333331,0,0,0,0,0,0,0.33333333333333331,0.33333333333333331,0,0,0,0,0.33333333333333331,0,0.33333333333333331,0,0.33333333333333331,0,0.33333333333333331,0,0.33333333333333331,0.33333333333333331,0.33333333333333331,0,0.33333333333333331,0,0,0,0,0.33333333333333331,0.33333333333333331,0.33333333333333331,0.33333333333333331,0,0,0,0,0,0,0.33333333333333331,0,0,0]
[null,1,"SOV Trip Reduction Programming / Commuter Financial Incentives",1,1,1,1,1,1,1,1,1,1,1,1,1,1,1,1,1,1,1,1,1,1,1,1,1,1,1,1,1,1,1,1,1,1,1,1,1,1,1,1,1,1,1,1,1,1,1,1,1,1,1,1,1,1,1,1,1,1,1,1,1,1,1,1,1,1,1,1,1,1,1,1,1,1,1,1,1,1,1,1,1,1,1,1,1,1,1,1,1,1,1,1,1,1,1,1,1,1,1,1,1,1,1,1,1,1,1,1,1,1,1,1,1,1,1,1,1,1,1,1,1,1,1,1,1,1]
[null,3,"Park and Ride",0,0,0,0,0.33333333333333331,0.33333333333333331,0.33333333333333331,0.33333333333333331,0.66666666666666663,0.33333333333333331,0.33333333333333331,0,0.33333333333333331,0,0.33333333333333331,0.33333333333333331,0.66666666666666663,0.66666666666666663,0.66666666666666663,1,0.66666666666666663,0.33333333333333331,0,0,0,0,0.33333333333333331,0,0,0,0.33333333333333331,0,0,0,0,0,0.66666666666666663,0,0.33333333333333331,0,0,0,0,0,0.33333333333333331,0.33333333333333331,0,0.33333333333333331,0.33333333333333331,0.33333333333333331,0,0.66666666666666663,0.66666666666666663,0.66666666666666663,0.33333333333333331,0,0,0,0,0.33333333333333331,0.66666666666666663,1,0.33333333333333331,0,0,0,0.33333333333333331,0.33333333333333331,0.33333333333333331,0,0,0.33333333333333331,0.66666666666666663,0,0,0,0.33333333333333331,0.66666666666666663,0.66666666666666663,0,0,0.33333333333333331,0.33333333333333331,0,0,0,0,0,0,0.33333333333333331,0.33333333333333331,0.33333333333333331,0.33333333333333331,0,0,0,0,0.33333333333333331,0,0,0,0.33333333333333331,0,0.33333333333333331,0.33333333333333331,0,0,0.33333333333333331,0,0,0,0,0.33333333333333331,0.33333333333333331,0.33333333333333331,0,0,0,0,0,0.33333333333333331,0,0.33333333333333331,0.33333333333333331,0,0]
[null,1,"Ridesharing and Ridematching- Carpool/Vanpool",0,0.5,0,0.5,0.5,0,0.5,1,1,0.5,0.5,0.5,0.5,0.5,1,1,1,0.5,0.5,0.5,0.5,0.5,0.5,0.5,0.5,0,0.5,0,0.5,0.5,0.5,0.5,0,0.5,0.5,1,1,1,0.5,0,0.5,0.5,0,1,0.5,0,0,0,0.5,0.5,1,1,1,1,0.5,0,0,0,0.5,1,0.5,0.5,0.5,0.5,0,0.5,1,0.5,0.5,0,0,0.5,0.5,0.5,0.5,1,1,0.5,0.5,0,0,0,0,0,0,0,0,0,0,0.5,0.5,0,0.5,0,0,0.5,0.5,0,0,0.5,0,0.5,0,0.5,0.5,0.5,0.5,0.5,0.5,0.5,0.5,0.5,0.5,1,1,1,0,0,0.5,1,0.5,0.5,0,0,0.5,0.5]
[null,3.5,"Transit",0,0.14285714285714285,0,0.14285714285714285,0.42857142857142855,0.2857142857142857,0.42857142857142855,0.42857142857142855,0.7142857142857143,0.42857142857142855,0.42857142857142855,0.14285714285714285,0.42857142857142855,0.14285714285714285,0.42857142857142855,0.42857142857142855,0.7142857142857143,0.7142857142857143,0.7142857142857143,1,0.7142857142857143,0.42857142857142855,0.14285714285714285,0.14285714285714285,0.14285714285714285,0,0.42857142857142855,0,0.14285714285714285,0.14285714285714285,0.42857142857142855,0.14285714285714285,0,0,0.14285714285714285,0.14285714285714285,0.7142857142857143,0.14285714285714285,0.42857142857142855,0,0.14285714285714285,0.14285714285714285,0,0.14285714285714285,0.42857142857142855,0.2857142857142857,0,0.2857142857142857,0.42857142857142855,0.42857142857142855,0.14285714285714285,0.7142857142857143,0.7142857142857143,0.7142857142857143,0.42857142857142855,0,0,0,0.14285714285714285,0.42857142857142855,0.7142857142857143,1,0.42857142857142855,0.14285714285714285,0,0.14285714285714285,0.42857142857142855,0.2857142857142857,0.42857142857142855,0,0,0.42857142857142855,0.7142857142857143,0.14285714285714285,0.14285714285714285,0.14285714285714285,0.42857142857142855,0.7142857142857143,0.7142857142857143,0,0,0.2857142857142857,0.2857142857142857,0,0,0,0,0,0,0.42857142857142855,0.42857142857142855,0.2857142857142857,0.42857142857142855,0,0,0.14285714285714285,0.14285714285714285,0.2857142857142857,0,0.14285714285714285,0,0.42857142857142855,0,0.42857142857142855,0.42857142857142855,0.14285714285714285,0.14285714285714285,0.42857142857142855,0.14285714285714285,0.14285714285714285,0.14285714285714285,0.14285714285714285,0.42857142857142855,0.42857142857142855,0.42857142857142855,0.14285714285714285,0,0,0.14285714285714285,0.14285714285714285,0.42857142857142855,0.14285714285714285,0.2857142857142857,0.2857142857142857,0.14285714285714285,0.14285714285714285]
[null,1,"Freight RR Grade Crossing",0,0,0,0,0,0,0,0,0,0,0,0,0,0,0,1,0,0,0,0,0,1,0,1,1,0,0,0,0,0,0,0,0,0,0,0,1,0,1,0,0,1,1,1,0,0,0,0,0,1,0,0,0,1,0,0,0,0,0,0,1,0,0,0,0,0,0,0,0,0,0,1,1,0,0,0,0,0,1,0,0,0,0,0,0,0,0,0,0,0,0,0,0,0,0,0,0,0,0,0,0,0,0,0,1,0,1,0,0,0,0,1,1,0,0,0,0,0,0,0,0,0,0,1,0,0]
[null,1,"Truck Lane Restrictions",0,0,0,0,0,0,0,0,0,1,1,0,0,0,0,0,0,0,0,0,1,1,0,1,1,0,0,0,0,0,0,0,0,0,0,0,0,0,0,0,0,0,0,0,1,0,0,0,0,0,0,0,0,0,0,0,0,0,1,1,0,0,1,1,1,0,0,0,0,0,0,1,1,0,0,1,0,0,0,0,1,1,1,0,0,0,0,0,1,1,1,1,1,1,1,0,0,0,0,1,0,0,0,0,0,0,0,0,0,0,0,0,0,0,0,1,1,1,1,0,0,0,0,0,1,1]
["Incentives to Use Alternative Modes",1,"Active Parking Mgmt",1,1,1,1,1,1,1,1,1,1,1,1,1,1,1,1,1,1,1,1,1,1,1,1,1,1,1,1,1,1,1,1,1,1,1,1,1,1,1,1,1,1,1,1,1,1,1,1,1,1,1,1,1,1,1,1,1,1,1,1,1,1,1,1,1,1,1,1,1,1,1,1,1,1,1,1,1,1,1,1,1,1,1,1,1,1,1,1,1,1,1,1,1,1,1,1,1,1,1,1,1,1,1,1,1,1,1,1,1,1,1,1,1,1,1,1,1,1,1,1,1,1,1,1,1,1]
[null,2,"HOV/Managed Lane Management",0,0.5,0,0.5,0,0,0,0.5,1,0.5,0.5,0,0.5,0.5,1,1,1,0.5,0.5,0.5,0.5,0.5,0.5,0.5,0.5,0.5,0.5,0.5,0.5,0,0.5,0.5,0.5,1,0,1,1,1,0,0,0.5,0.5,0.5,1,0.5,0.5,0.5,0.5,0.5,0.5,1,1,1,1,0.5,0,0.5,0.5,0.5,1,0.5,0.5,0.5,0.5,0,0,1,1,0.5,0.5,0,0.5,0.5,0.5,0.5,1,1,0.5,0.5,0,0.5,0.5,0.5,0.5,0.5,0,0,0,0.5,0.5,0.5,0.5,0.5,0.5,0.5,0.5,0.5,0.5,0.5,0.5,0,0.5,0,0,0.5,0.5,0.5,0.5,0.5,0.5,0.5,0.5,0.5,0.5,1,1,0.5,0.5,0.5,0.5,0.5,0,0.5,0.5,0.5,0.5]
[null,4,"Emergency Routing",0,0.5,0,0.5,0,0.25,0,0,0.25,0.5,0.5,0.25,0.5,0.5,0.5,0.75,0.25,0.25,0.5,0.25,0.25,1,0.5,0.5,0.75,0.5,0.5,0.5,0.5,0.25,0.25,0.5,0.5,0.5,0.25,0.25,0.5,0.5,0.25,0.25,0.5,0.5,1,0.75,0.5,0.25,0.75,0.5,0.5,0.5,0.5,0.25,0.5,1,0.5,0.25,0.75,0.5,0.5,0.5,0.75,0.5,0.5,0.25,0.25,0.25,0.25,0.5,0.5,0.25,0.25,0.5,0.75,0.5,0.5,0.25,0.25,0.5,0.75,0.25,0.5,0.75,0.5,0.25,0.25,0,0,0,0.5,0.5,0.5,0.5,0.25,0.5,0.25,0.25,0.5,0.75,0.25,0.25,0,0.5,0.25,0,1,0.25,0.5,0.25,0.25,0.5,0.25,0.5,0.5,0.25,0.5,0.25,0.5,0.25,0.25,0,0.5,0,0.5,0.75,0.75,0.5]
[null,1.5,"Mobility Assistance Patrol / Courtesy Patrol",0,1,0,0.66666666666666663,0,0,0.33333333333333331,0,1,1,1,0,0.66666666666666663,1,1,0.66666666666666663,0.66666666666666663,1,1,0.66666666666666663,0.66666666666666663,1,1,1,1,0.66666666666666663,0.66666666666666663,0.66666666666666663,0.66666666666666663,0,1,1,0.66666666666666663,0.66666666666666663,0.33333333333333331,1,0.66666666666666663,0.66666666666666663,0.33333333333333331,0,0.66666666666666663,0.66666666666666663,0.66666666666666663,1,0.66666666666666663,0.66666666666666663,0.66666666666666663,0.66666666666666663,0.66666666666666663,0.66666666666666663,1,1,1,1,0.66666666666666663,0.33333333333333331,1,1,0.66666666666666663,0.66666666666666663,0.66666666666666663,0.66666666666666663,1,1,0.33333333333333331,0.33333333333333331,0.66666666666666663,0.66666666666666663,0.66666666666666663,0.66666666666666663,0,0.66666666666666663,1,1,1,0.66666666666666663,0.66666666666666663,1,0.66666666666666663,0,0.66666666666666663,1,1,1,1,0.33333333333333331,0,0.33333333333333331,1,1,1,1,1,1,1,0.66666666666666663,0.66666666666666663,0.66666666666666663,0.66666666666666663,0.66666666666666663,0.33333333333333331,0.66666666666666663,0,0.33333333333333331,1,1,0.66666666666666663,0.66666666666666663,1,1,0.66666666666666663,1,1,0,0.66666666666666663,0.66666666666666663,1,1,1,0,1,0.33333333333333331,0.66666666666666663,1,1,1]
[null,3.5,"Strategic Incident Response and Clearance Time Program",0,0.7142857142857143,0,0.42857142857142855,0,0.14285714285714285,0.2857142857142857,0,0.5714285714285714,0.7142857142857143,0.7142857142857143,0.14285714285714285,0.42857142857142855,0.7142857142857143,0.7142857142857143,0.5714285714285714,0.2857142857142857,0.5714285714285714,0.7142857142857143,0.2857142857142857,0.2857142857142857,1,0.7142857142857143,0.7142857142857143,0.8571428571428571,0.42857142857142855,0.42857142857142855,0.42857142857142855,0.42857142857142855,0.14285714285714285,0.5714285714285714,0.7142857142857143,0.42857142857142855,0.42857142857142855,0.42857142857142855,0.5714285714285714,0.42857142857142855,0.42857142857142855,0.42857142857142855,0.14285714285714285,0.42857142857142855,0.42857142857142855,0.7142857142857143,0.8571428571428571,0.42857142857142855,0.2857142857142857,0.5714285714285714,0.42857142857142855,0.42857142857142855,0.42857142857142855,0.7142857142857143,0.5714285714285714,0.7142857142857143,1,0.42857142857142855,0.42857142857142855,0.8571428571428571,0.7142857142857143,0.42857142857142855,0.42857142857142855,0.5714285714285714,0.42857142857142855,0.7142857142857143,0.5714285714285714,0.42857142857142855,0.42857142857142855,0.2857142857142857,0.42857142857142855,0.42857142857142855,0.2857142857142857,0.14285714285714285,0.42857142857142855,0.8571428571428571,0.7142857142857143,0.7142857142857143,0.2857142857142857,0.2857142857142857,0.7142857142857143,0.5714285714285714,0.14285714285714285,0.42857142857142855,0.8571428571428571,0.7142857142857143,0.5714285714285714,0.5714285714285714,0.2857142857142857,0,0.2857142857142857,0.7142857142857143,0.7142857142857143,0.7142857142857143,0.7142857142857143,0.5714285714285714,0.7142857142857143,0.5714285714285714,0.2857142857142857,0.42857142857142855,0.5714285714285714,0.2857142857142857,0.2857142857142857,0.2857142857142857,0.42857142857142855,0.14285714285714285,0.2857142857142857,1,0.5714285714285714,0.42857142857142855,0.2857142857142857,0.5714285714285714,0.7142857142857143,0.2857142857142857,0.7142857142857143,0.7142857142857143,0.14285714285714285,0.42857142857142855,0.2857142857142857,0.7142857142857143,0.5714285714285714,0.5714285714285714,0,0.7142857142857143,0.2857142857142857,0.42857142857142855,0.8571428571428571,0.8571428571428571,0.7142857142857143]
[null,1,"Traffic Incident Management Training",0,0,0,0,0,0,0,0,0,0,0,0,0,0,0,0,0,0,0,0,0,0,0,0,0,0,0,0,0,0,0,0,0,0,0,0,0,0,0,0,0,0,0,0,0,0,0,0,0,0,0,0,0,0,0,0,0,0,0,0,0,0,0,0,0,0,0,0,0,0,1,0,0,0,0,0,0,0,0,0,0,0,0,0,0,0,1,0,0,0,0,0,0,0,0,0,0,0,0,0,0,0,0,0,0,0,0,0,0,0,0,0,0,0,0,0,0,0,0,0,0,0,0,0,0,0]
["Roadway Infrastructure Improvements",2,"Access Management Improvements (Turn Lanes, Close Driveways)",0,0.5,0,0.5,0,0.5,0,0,0,0.5,0.5,0.5,0.5,0.5,0.5,0.5,0,0,0.5,0,0,1,0.5,0,0.5,0.5,0.5,0.5,0.5,0.5,0,0.5,0.5,0.5,0.5,0,0,0.5,0,0.5,0.5,0,1,0.5,0.5,0,1,0.5,0.5,0,0.5,0,0.5,1,0.5,0.5,1,0.5,0.5,0.5,0.5,0.5,0.5,0,0.5,0.5,0,0.5,0.5,0,0.5,0,0.5,0.5,0.5,0,0,0.5,0.5,0.5,0.5,1,0.5,0,0,0,0,0,0.5,0.5,0.5,0.5,0,0.5,0,0,0.5,1,0,0,0,0.5,0.5,0,1,0,0,0,0,0.5,0,0,0,0.5,0.5,0,0.5,0,0,0,0.5,0,0.5,0.5,1,0.5]
[null,1,"Bottleneck Removal",0,0,0,1,1,0,1,1,1,1,1,0,1,1,0,0,1,0,0,1,1,0,1,0,0,1,1,1,0,1,0,0,0,0,1,1,1,1,0,1,1,1,0,0,1,0,0,1,1,0,0,0,0,0,1,0,1,1,0,0,1,0,1,0,0,1,1,0,1,1,0,1,1,0,0,1,1,0,1,1,0,0,0,0,0,1,0,0,1,1,1,1,0,0,0,0,1,0,0,1,0,0,0,0,1,0,0,0,0,0,0,0,1,0,0,0,1,0,1,0,0,1,1,1,0,1]
[null,1.5,"Bus Loading Bays",0,0.66666666666666663,0,0,0,0,0,0.66666666666666663,0.66666666666666663,0.66666666666666663,0,0,0,0,0,0,0.66666666666666663,0.66666666666666663,0.66666666666666663,0.66666666666666663,0.66666666666666663,1,0,0,0,0,0,0,0,0,0.66666666666666663,0,0,0,0,0,0.66666666666666663,0.66666666666666663,0.66666666666666663,0,0.66666666666666663,0,0.33333333333333331,0,0.66666666666666663,0.66666666666666663,0.33333333333333331,0,0.66666666666666663,0.66666666666666663,0,0.66666666666666663,0.66666666666666663,1,0.66666666666666663,0,0.33333333333333331,0,0,0.66666666666666663,0.66666666666666663,1,1,0.66666666666666663,0,0,0.66666666666666663,0.66666666666666663,0,0,0,0.66666666666666663,1,0.33333333333333331,0.33333333333333331,0,0.66666666666666663,1,1,0,0.33333333333333331,1,0.66666666666666663,0,0,0,0,0,0,0.66666666666666663,0.66666666666666663,0,0,0,0,0.66666666666666663,0.33333333333333331,1,0,0.66666666666666663,0,0.66666666666666663,0,0.66666666666666663,1,0.66666666666666663,0,0.66666666666666663,0,0,0,0,0.66666666666666663,0.66666666666666663,0.66666666666666663,0.66666666666666663,0,0,0,0,0,0,0.66666666666666663,0,0.33333333333333331,0]
[null,1,"Intersection Improvements",1,1,1,1,1,1,1,1,1,1,1,1,1,1,1,1,1,1,1,1,1,1,1,1,1,1,1,1,1,1,1,1,1,1,1,1,1,1,1,1,1,1,1,1,1,1,1,1,1,1,1,1,1,1,1,1,1,1,1,1,1,1,1,1,1,1,1,1,1,1,1,1,1,1,1,1,1,1,1,1,1,1,1,1,1,1,1,1,1,1,1,1,1,1,1,1,1,1,1,1,1,1,1,1,1,1,1,1,1,1,1,1,1,1,1,1,1,1,1,1,1,1,1,1,1,1]
["Sustainable Development Improvements",2.5,"Bike/Ped Improvements",0,0.2,0,0,0,0,0,0.2,0.4,0.2,0,0,0.2,0,0.2,0.2,0.4,0.4,0.4,0.6,0.4,0.6,0,0,0,0,0.2,0,0,0,0.2,0,0,0,0,0,0.4,0.2,0.2,0,0.2,0,0.4,0,0.2,0.2,0.4,0,0.2,0.2,0,0.4,0.4,0.8,0.2,0,0.4,0,0,0.4,0.4,1,0.8,0.2,0,0,0.2,0.2,0,0,0,0.2,0.8,0.4,0.4,0,0.2,0.8,0.8,0,0.4,0.6,0.2,0,0,0,0,0,0,0.2,0.2,0,0,0,0,0.2,0.4,0.6,0,0.2,0,0.2,0,0.2,0.6,0.2,0,0.2,0,0,0,0,0.2,0.2,0.2,0.2,0,0,0,0,0,0,0.2,0,0.4,0]
[null,2.5,"Bike Parking Facilities",0,0.2,0,0,0,0,0,0.2,0.4,0.2,0,0,0.2,0,0.2,0.2,0.4,0.4,0.4,0.6,0.4,0.6,0,0,0,0,0.2,0,0,0,0.2,0,0,0,0,0,0.4,0.2,0.2,0,0.2,0,0.4,0,0.2,0.2,0.4,0,0.2,0.2,0,0.4,0.4,0.8,0.2,0,0.4,0,0,0.4,0.4,1,0.8,0.2,0,0,0.2,0.2,0,0,0,0.2,0.8,0.4,0.4,0,0.2,0.8,0.8,0,0.4,0.6,0.2,0,0,0,0,0,0,0.2,0.2,0,0,0,0,0.2,0.4,0.6,0,0.2,0,0.2,0,0.2,0.6,0.2,0,0.2,0,0,0,0,0.2,0.2,0.2,0.2,0,0,0,0,0,0,0.2,0,0.4,0]
[null,0,"Context Sensitive Design","","","","","","","","","","","","","","","","","","","","","","","","","","","","","","","","","","","","","","","","","","","","","","","","","","","","","","","","","","","","","","","","","","","","","","","","","","","","","","","","","","","","","","","","","","","","","","","","","","","","","","","","","","","","","","","","","","","","","","","","","","","","","",""]
[null,0,"Location of Efficient Development","","","","","","","","","","","","","","","","","","","","","","","","","","","","","","","","","","","","","","","","","","","","","","","","","","","","","","","","","","","","","","","","","","","","","","","","","","","","","","","","","","","","","","","","","","","","","","","","","","","","","","","","","","","","","","","","","","","","","","","","","","","","","",""]
[null,1,"Pedestrianized Streets",0,0,0,0,0,0,0,0,0,0,0,0,0,0,0,0,0,0,0,0,0,1,0,0,0,0,0,0,0,0,0,0,0,0,0,0,0,0,0,0,0,0,1,0,0,0,1,0,0,0,0,0,0,1,0,0,1,0,0,0,0,1,1,0,0,0,0,0,0,0,0,0,1,1,1,0,0,1,1,0,1,1,0,0,0,0,0,0,0,0,0,0,0,0,0,0,1,1,0,0,0,0,0,0,1,0,0,0,0,0,0,0,0,0,0,0,0,0,0,0,0,0,0,0,1,0]
[null,3,"Transit Oriented Development",0,0.33333333333333331,0,0,0,0,0,0.33333333333333331,0.66666666666666663,0.33333333333333331,0,0,0.33333333333333331,0,0.33333333333333331,0.33333333333333331,0.66666666666666663,0.66666666666666663,0.66666666666666663,1,0.66666666666666663,0.33333333333333331,0,0,0,0,0.33333333333333331,0,0,0,0.33333333333333331,0,0,0,0,0,0.66666666666666663,0.33333333333333331,0.33333333333333331,0,0.33333333333333331,0,0,0,0.33333333333333331,0.33333333333333331,0,0,0.33333333333333331,0.33333333333333331,0,0.66666666666666663,0.66666666666666663,0.66666666666666663,0.33333333333333331,0,0,0,0,0.66666666666666663,0.66666666666666663,1,0.66666666666666663,0.33333333333333331,0,0,0.33333333333333331,0.33333333333333331,0,0,0,0.33333333333333331,0.66666666666666663,0,0,0,0.33333333333333331,0.66666666666666663,0.66666666666666663,0,0,0.33333333333333331,0.33333333333333331,0,0,0,0,0,0,0.33333333333333331,0.33333333333333331,0,0,0,0,0.33333333333333331,0,0.33333333333333331,0,0.33333333333333331,0,0.33333333333333331,0,0.33333333333333331,0.33333333333333331,0.33333333333333331,0,0.33333333333333331,0,0,0,0,0.33333333333333331,0.33333333333333331,0.33333333333333331,0.33333333333333331,0,0,0,0,0,0,0.33333333333333331,0,0,0]
["System Management and Operations Improvements",2,"Active Traffic Managemtent (Lane Assignment, Re-Striping, Turning Movement and lane use restrictions",0,0.5,0,0.5,0,0.5,0,0,0,0.5,0.5,0.5,0.5,0.5,0.5,0.5,0,0,0.5,0,0,1,0.5,0,0.5,0.5,0.5,0.5,0.5,0.5,0,0.5,0.5,0.5,0.5,0,0,0.5,0,0.5,0.5,0,1,0.5,0.5,0,1,0.5,0.5,0,0.5,0,0.5,1,0.5,0.5,1,0.5,0.5,0.5,0.5,0.5,0.5,0,0.5,0.5,0,0.5,0.5,0,0.5,0,0.5,0.5,0.5,0,0,0.5,0.5,0.5,0.5,1,0.5,0,0,0,0,0,0.5,0.5,0.5,0.5,0,0.5,0,0,0.5,1,0,0,0,0.5,0.5,0,1,0,0,0,0,0.5,0,0,0,0.5,0.5,0,0.5,0,0,0,0.5,0,0.5,0.5,1,0.5]
[null,1,"ITS Devices",1,0,0,0,0,0,1,0,0,0,0,1,0,0,0,0,0,0,0,0,0,0,0,0,0,0,0,0,0,0,0,0,0,0,0,0,0,0,1,0,0,0,0,0,0,0,0,0,0,0,0,0,0,0,0,0,0,0,0,0,0,0,0,0,1,1,0,0,0,0,1,0,0,0,0,0,0,0,0,1,0,0,0,0,0,0,0,1,0,0,0,0,0,0,0,0,0,0,0,0,1,0,1,0,0,0,0,0,0,0,0,0,0,0,0,0,0,0,0,0,0,0,0,0,0,0]
[null,1,"Probe Surveilance",1,1,1,1,1,1,1,1,1,1,1,1,1,1,1,1,1,1,1,1,1,1,1,1,1,1,1,1,1,1,1,1,1,1,1,1,1,1,1,1,1,1,1,1,1,1,1,1,1,1,1,1,1,1,1,1,1,1,1,1,1,1,1,1,1,1,1,1,1,1,1,1,1,1,1,1,1,1,1,1,1,1,1,1,1,1,1,1,1,1,1,1,1,1,1,1,1,1,1,1,1,1,1,1,1,1,1,1,1,1,1,1,1,1,1,1,1,1,1,1,1,1,1,1,1,1]
[null,4,"Regional Traffic Control",0,0.5,0,0.5,0,0.25,0,0,0.25,0.5,0.5,0.25,0.5,0.5,0.5,0.75,0.25,0.25,0.5,0.25,0.25,1,0.5,0.5,0.75,0.5,0.5,0.5,0.5,0.25,0.25,0.5,0.5,0.5,0.25,0.25,0.5,0.5,0.25,0.25,0.5,0.5,1,0.75,0.5,0.25,0.75,0.5,0.5,0.5,0.5,0.25,0.5,1,0.5,0.25,0.75,0.5,0.5,0.5,0.75,0.5,0.5,0.25,0.25,0.25,0.25,0.5,0.5,0.25,0.25,0.5,0.75,0.5,0.5,0.25,0.25,0.5,0.75,0.25,0.5,0.75,0.5,0.25,0.25,0,0,0,0.5,0.5,0.5,0.5,0.25,0.5,0.25,0.25,0.5,0.75,0.25,0.25,0,0.5,0.25,0,1,0.25,0.5,0.25,0.25,0.5,0.25,0.5,0.5,0.25,0.5,0.25,0.5,0.25,0.25,0,0.5,0,0.5,0.75,0.75,0.5]
[null,0.5,"Reversible Lane Management",0,0,0,0,0,0,0,0,0,0,0,0,0,0,0,0,0,0,0,0,0,1,0,0,0,0,0,0,0,0,0,0,0,0,0,0,0,0,0,0,0,0,1,0,0,0,1,0,0,0,0,0,0,1,0,0,1,0,0,0,0,1,1,0,0,0,0,0,0,0,0,0,1,1,1,0,0,1,1,0,1,1,0,0,0,0,0,0,0,0,0,0,0,0,0,0,1,1,0,0,0,0,0,0,1,0,0,0,0,0,0,0,0,0,0,0,0,0,0,0,0,0,0,0,1,0]
[null,1,"Shoulder Utilization Program",0,1,0,0,0,0,1,0,1,1,1,0,0,1,1,0,0,1,1,0,0,1,1,1,1,0,0,0,0,0,1,1,0,0,1,1,0,0,1,0,0,0,0,1,0,0,0,0,0,0,1,1,1,1,0,1,1,1,0,0,0,0,1,1,1,1,0,0,0,0,0,0,1,1,1,0,0,1,0,0,0,1,1,1,1,1,0,1,1,1,1,1,1,1,1,0,0,0,0,0,1,0,0,1,1,1,0,0,1,1,0,1,1,0,0,0,1,1,1,0,1,1,0,1,1,1]
[null,2,"Traffic Signal Improvements",0,0.5,0,0.5,0,0.5,0,0,0,0.5,0.5,0.5,0.5,0.5,0.5,0.5,0,0,0.5,0,0,1,0.5,0,0.5,0.5,0.5,0.5,0.5,0.5,0,0.5,0.5,0.5,0.5,0,0,0.5,0,0.5,0.5,0,1,0.5,0.5,0,1,0.5,0.5,0,0.5,0,0.5,1,0.5,0.5,1,0.5,0.5,0.5,0.5,0.5,0.5,0,0.5,0.5,0,0.5,0.5,0,0.5,0,0.5,0.5,0.5,0,0,0.5,0.5,0.5,0.5,1,0.5,0,0,0,0,0,0.5,0.5,0.5,0.5,0,0.5,0,0,0.5,1,0,0,0,0.5,0.5,0,1,0,0,0,0,0.5,0,0,0,0.5,0.5,0,0.5,0,0,0,0.5,0,0.5,0.5,1,0.5]
[null,1,"Speed Harmonization and Monitoring",1,1,1,1,1,1,1,1,1,1,1,1,1,1,1,1,1,1,1,1,1,1,1,1,1,1,1,1,1,1,1,1,1,1,1,1,1,1,1,1,1,1,1,1,1,1,1,1,1,1,1,1,1,1,1,1,1,1,1,1,1,1,1,1,1,1,1,1,1,1,1,1,1,1,1,1,1,1,1,1,1,1,1,1,1,1,1,1,1,1,1,1,1,1,1,1,1,1,1,1,1,1,1,1,1,1,1,1,1,1,1,1,1,1,1,1,1,1,1,1,1,1,1,1,1,1]
["Transit System Efficiency Improvements",1,"Demand Response Transit Operations",1,0,1,1,0,0,0,0,0,0,0,1,1,1,1,0,0,0,0,0,0,0,1,1,1,1,0,1,1,1,0,1,1,1,1,0,0,0,0,1,0,1,1,0,0,0,1,0,0,0,1,0,0,0,0,1,1,1,1,0,0,0,0,0,1,1,0,0,0,1,1,0,0,1,1,1,0,0,0,1,1,0,0,1,1,1,1,1,1,0,0,0,0,1,1,0,1,0,1,0,1,0,1,0,0,0,1,0,1,1,1,1,0,0,0,0,1,1,1,1,0,1,0,0,1,1]
[null,3,"Adaptive/Demand Responsive Signal Systems",0,0.66666666666666663,0,0.33333333333333331,0,0.33333333333333331,0,0.33333333333333331,0.33333333333333331,0.66666666666666663,0.33333333333333331,0.33333333333333331,0.33333333333333331,0.33333333333333331,0.33333333333333331,0.33333333333333331,0.33333333333333331,0.33333333333333331,0.66666666666666663,0.33333333333333331,0.33333333333333331,1,0.33333333333333331,0,0.33333333333333331,0.33333333333333331,0.33333333333333331,0.33333333333333331,0.33333333333333331,0.33333333333333331,0.33333333333333331,0.33333333333333331,0.33333333333333331,0.33333333333333331,0.33333333333333331,0,0.33333333333333331,0.66666666666666663,0.33333333333333331,0.33333333333333331,0.66666666666666663,0,0.66666666666666663,0.33333333333333331,0.66666666666666663,0.33333333333333331,0.66666666666666663,0.33333333333333331,0.66666666666666663,0.33333333333333331,0.33333333333333331,0.33333333333333331,0.66666666666666663,1,0.66666666666666663,0.33333333333333331,0.66666666666666663,0.33333333333333331,0.33333333333333331,0.66666666666666663,0.66666666666666663,0.66666666666666663,0.66666666666666663,0.33333333333333331,0.33333333333333331,0.33333333333333331,0.33333333333333331,0.66666666666666663,0.33333333333333331,0,0.33333333333333331,0.33333333333333331,0.66666666666666663,0.33333333333333331,0.33333333333333331,0,0.33333333333333331,0.66666666666666663,0.66666666666666663,0.33333333333333331,0.33333333333333331,1,0.66666666666666663,0,0,0,0,0,0.33333333333333331,0.66666666666666663,0.66666666666666663,0.33333333333333331,0,0.33333333333333331,0,0.33333333333333331,0.33333333333333331,1,0,0.33333333333333331,0,0.66666666666666663,0.33333333333333331,0.33333333333333331,1,0.33333333333333331,0,0.33333333333333331,0,0.33333333333333331,0,0,0.33333333333333331,0.66666666666666663,0.66666666666666663,0.33333333333333331,0.33333333333333331,0,0,0,0.33333333333333331,0,0.66666666666666663,0.33333333333333331,0.66666666666666663,0.33333333333333331]
[null,4,"Transit Fixed-Route Operations",0,0.5,0,0.25,0,0.25,0,0.5,0.5,0.5,0.25,0.25,0.25,0.25,0.5,0.5,0.5,0.25,0.5,0.25,0.25,0.75,0.25,0,0.25,0.25,0.25,0.25,0.25,0.25,0.25,0.25,0.25,0.5,0.25,0.25,0.5,0.75,0.25,0.25,0.5,0,0.5,0.5,0.5,0.25,0.5,0.25,0.5,0.25,0.5,0.5,0.75,1,0.5,0.25,0.5,0.25,0.25,0.75,0.5,0.5,0.5,0.25,0.25,0.25,0.5,0.75,0.25,0,0.25,0.25,0.5,0.25,0.25,0.25,0.5,0.5,0.5,0.25,0.25,0.75,0.5,0,0,0,0,0,0.25,0.5,0.5,0.25,0,0.25,0,0.25,0.25,0.75,0,0.25,0,0.5,0.25,0.25,0.75,0.25,0,0.25,0,0.25,0,0,0.25,0.75,0.75,0.5,0.25,0,0,0.25,0.25,0,0.5,0.25,0.5,0.25]
[null,5,"Transit Management",0,0.2,0,0,0,0,0,0.4,0.6,0.2,0,0,0.2,0,0.4,0.4,0.6,0.4,0.4,0.6,0.4,0.4,0,0,0,0,0.2,0,0,0,0.2,0,0,0.2,0,0.2,0.6,0.4,0.2,0,0.2,0,0.2,0.2,0.2,0.2,0.2,0,0.2,0.2,0.2,0.6,0.6,0.8,0.2,0,0.2,0,0,0.6,0.4,0.8,0.6,0.2,0,0,0.4,0.4,0,0,0,0.2,0.6,0.2,0.2,0.2,0.4,0.6,0.6,0,0.2,0.4,0.2,0,0,0,0,0,0,0.2,0.2,0,0,0,0,0.2,0.2,0.4,0,0.2,0,0.2,0,0.2,0.4,0.2,0,0.2,0,0,0,0,0.2,0.4,0.4,0.4,0,0,0,0.2,0,0,0.2,0,0.2,0]
[null,1,"Transit System Signal Priority",0,1,0,0,0,0,0,1,1,1,0,0,0,0,0,0,1,1,1,1,1,1,0,0,0,0,0,0,0,0,1,0,0,0,0,0,1,1,1,0,1,0,0,0,1,1,0,0,1,1,0,1,1,1,1,0,0,0,0,1,1,1,1,1,0,0,1,1,0,0,0,1,1,0,0,0,1,1,1,0,0,1,1,0,0,0,0,0,0,1,1,0,0,0,0,1,0,1,0,1,0,1,0,1,1,1,0,1,0,0,0,0,1,1,1,1,0,0,0,0,0,0,1,0,0,0]
[null,3,"Transit Vehicle Tracking",0,0.33333333333333331,0,0,0,0,0,0.33333333333333331,0.66666666666666663,0.33333333333333331,0,0,0.33333333333333331,0,0.33333333333333331,0.33333333333333331,0.66666666666666663,0.66666666666666663,0.66666666666666663,1,0.66666666666666663,0.33333333333333331,0,0,0,0,0.33333333333333331,0,0,0,0.33333333333333331,0,0,0,0,0,0.66666666666666663,0.33333333333333331,0.33333333333333331,0,0.33333333333333331,0,0,0,0.33333333333333331,0.33333333333333331,0,0,0.33333333333333331,0.33333333333333331,0,0.66666666666666663,0.66666666666666663,0.66666666666666663,0.33333333333333331,0,0,0,0,0.66666666666666663,0.66666666666666663,1,0.66666666666666663,0.33333333333333331,0,0,0.33333333333333331,0.33333333333333331,0,0,0,0.33333333333333331,0.66666666666666663,0,0,0,0.33333333333333331,0.66666666666666663,0.66666666666666663,0,0,0.33333333333333331,0.33333333333333331,0,0,0,0,0,0,0.33333333333333331,0.33333333333333331,0,0,0,0,0.33333333333333331,0,0.33333333333333331,0,0.33333333333333331,0,0.33333333333333331,0,0.33333333333333331,0.33333333333333331,0.33333333333333331,0,0.33333333333333331,0,0,0,0,0.33333333333333331,0.33333333333333331,0.33333333333333331,0.33333333333333331,0,0,0,0,0,0,0.33333333333333331,0,0,0]
["Traveler Information Services",1,511,1,1,1,1,1,1,1,1,1,1,1,1,1,1,1,1,1,1,1,1,1,1,1,1,1,1,1,1,1,1,1,1,1,1,1,1,1,1,1,1,1,1,1,1,1,1,1,1,1,1,1,1,1,1,1,1,1,1,1,1,1,1,1,1,1,1,1,1,1,1,1,1,1,1,1,1,1,1,1,1,1,1,1,1,1,1,1,1,1,1,1,1,1,1,1,1,1,1,1,1,1,1,1,1,1,1,1,1,1,1,1,1,1,1,1,1,1,1,1,1,1,1,1,1,1,1]
[null,1,"Integrated Transportation Management/Route Guidance",1,1,1,1,1,1,1,1,1,1,1,1,1,1,1,1,1,1,1,1,1,1,1,1,1,1,1,1,1,1,1,1,1,1,1,1,1,1,1,1,1,1,1,1,1,1,1,1,1,1,1,1,1,1,1,1,1,1,1,1,1,1,1,1,1,1,1,1,1,1,1,1,1,1,1,1,1,1,1,1,1,1,1,1,1,1,1,1,1,1,1,1,1,1,1,1,1,1,1,1,1,1,1,1,1,1,1,1,1,1,1,1,1,1,1,1,1,1,1,1,1,1,1,1,1,1]
[null,1,"Dynamic Pricing",0,0,0,0,0,0,0,1,1,0,0,0,0,0,1,1,1,0,0,0,0,0,0,0,0,1,0,1,1,0,0,0,0,1,0,1,1,1,1,0,1,1,1,1,0,0,1,1,1,1,1,1,1,1,0,0,0,0,0,0,0,0,0,0,0,0,0,0,0,0,0,0,0,0,0,1,1,0,0,0,0,0,0,0,0,0,0,0,0,0,0,0,0,0,0,1,1,0,0,0,0,0,0,0,0,0,1,1,1,1,1,0,0,1,1,1,0,0,0,1,0,0,0,0,0,0]
[null,0,"Dynamic Routing","","","","","","","","","","","","","","","","","","","","","","","","","","","","","","","","","","","","","","","","","","","","","","","","","","","","","","","","","","","","","","","","","","","","","","","","","","","","","","","","","","","","","","","","","","","","","","","","","","","","","","","","","","","","","","","","","","","","","","","","","","","","","",""]
[null,0,"Mobility as a service","","","","","","","","","","","","","","","","","","","","","","","","","","","","","","","","","","","","","","","","","","","","","","","","","","","","","","","","","","","","","","","","","","","","","","","","","","","","","","","","","","","","","","","","","","","","","","","","","","","","","","","","","","","","","","","","","","","","","","","","","","","","","",""]
[null,null,null,{"$f":"COUNTIF(Table2[1.4], 1)","v":9},{"$f":"COUNTIF(Table2[1.5], 1)","v":10},{"$f":"COUNTIF(Table2[1.6], 1)","v":8},{"$f":"COUNTIF(Table2[3.1], 1)","v":9},{"$f":"COUNTIF(Table2[5.1], 1)","v":8},{"$f":"COUNTIF(Table2[5.2], 1)","v":7},{"$f":"COUNTIF(Table2[5.4], 1)","v":10},{"$f":"COUNTIF(Table2[5.5], 1)","v":11},{"$f":"COUNTIF(Table2[5.6], 1)","v":14},{"$f":"COUNTIF(Table2[5.7], 1)","v":12},{"$f":"COUNTIF(Table2[5.8], 1)","v":11},{"$f":"COUNTIF(Table2[5.9], 1)","v":9},{"$f":"COUNTIF(Table2[7.1], 1)","v":9},{"$f":"COUNTIF(Table2[7.10], 1)","v":11},{"$f":"COUNTIF(Table2[7.2], 1)","v":13},{"$f":"COUNTIF(Table2[7.3], 1)","v":11},{"$f":"COUNTIF(Table2[7.4], 1)","v":12},{"$f":"COUNTIF(Table2[7.5], 1)","v":10},{"$f":"COUNTIF(Table2[7.6], 1)","v":10},{"$f":"COUNTIF(Table2[7.7], 1)","v":14},{"$f":"COUNTIF(Table2[7.8], 1)","v":10},{"$f":"COUNTIF(Table2[7.9], 1)","v":23},{"$f":"COUNTIF(Table2[9.1], 1)","v":11},{"$f":"COUNTIF(Table2[9.2], 1)","v":12},{"$f":"COUNTIF(Table2[9.3], 1)","v":12},{"$f":"COUNTIF(Table2[9.4], 1)","v":10},{"$f":"COUNTIF(Table2[11.10], 1)","v":8},{"$f":"COUNTIF(Table2[11.3], 1)","v":10},{"$f":"COUNTIF(Table2[11.4], 1)","v":9},{"$f":"COUNTIF(Table2[11.5], 1)","v":9},{"$f":"COUNTIF(Table2[11.6], 1)","v":10},{"$f":"COUNTIF(Table2[11.7], 1)","v":10},{"$f":"COUNTIF(Table2[11.8], 1)","v":8},{"$f":"COUNTIF(Table2[11.9], 1)","v":10},{"$f":"COUNTIF(Table2[12.3], 1)","v":10},{"$f":"COUNTIF(Table2[12.4], 1)","v":13},{"$f":"COUNTIF(Table2[12.5], 1)","v":13},{"$f":"COUNTIF(Table2[12.6], 1)","v":12},{"$f":"COUNTIF(Table2[13.1], 1)","v":12},{"$f":"COUNTIF(Table2[14.2], 1)","v":9},{"$f":"COUNTIF(Table2[15.1], 1)","v":10},{"$f":"COUNTIF(Table2[15.2], 1)","v":11},{"$f":"COUNTIF(Table2[15.3], 1)","v":17},{"$f":"COUNTIF(Table2[17.1], 1)","v":13},{"$f":"COUNTIF(Table2[17.2], 1)","v":10},{"$f":"COUNTIF(Table2[17.3], 1)","v":8},{"$f":"COUNTIF(Table2[21.1], 1)","v":14},{"$f":"COUNTIF(Table2[21.2], 1)","v":9},{"$f":"COUNTIF(Table2[21.3], 1)","v":10},{"$f":"COUNTIF(Table2[21.4], 1)","v":10},{"$f":"COUNTIF(Table2[22.1], 1)","v":13},{"$f":"COUNTIF(Table2[22.2], 1)","v":13},{"$f":"COUNTIF(Table2[22.3], 1)","v":13},{"$f":"COUNTIF(Table2[22.4], 1)","v":26},{"$f":"COUNTIF(Table2[22.5], 1)","v":9},{"$f":"COUNTIF(Table2[23.1], 1)","v":9},{"$f":"COUNTIF(Table2[23.2], 1)","v":16},{"$f":"COUNTIF(Table2[23.3], 1)","v":11},{"$f":"COUNTIF(Table2[23.4], 1)","v":9},{"$f":"COUNTIF(Table2[23.5], 1)","v":11},{"$f":"COUNTIF(Table2[23.6], 1)","v":10},{"$f":"COUNTIF(Table2[25.1], 1)","v":19},{"$f":"COUNTIF(Table2[27.1], 1)","v":15},{"$f":"COUNTIF(Table2[27.2], 1)","v":11},{"$f":"COUNTIF(Table2[27.3], 1)","v":11},{"$f":"COUNTIF(Table2[28.1], 1)","v":11},{"$f":"COUNTIF(Table2[28.10], 1)","v":11},{"$f":"COUNTIF(Table2[28.11], 1)","v":9},{"$f":"COUNTIF(Table2[28.12], 1)","v":8},{"$f":"COUNTIF(Table2[28.13], 1)","v":9},{"$f":"COUNTIF(Table2[28.14], 1)","v":10},{"$f":"COUNTIF(Table2[28.2], 1)","v":11},{"$f":"COUNTIF(Table2[28.3], 1)","v":17},{"$f":"COUNTIF(Table2[28.4], 1)","v":12},{"$f":"COUNTIF(Table2[28.5], 1)","v":12},{"$f":"COUNTIF(Table2[28.6], 1)","v":13},{"$f":"COUNTIF(Table2[28.7], 1)","v":12},{"$f":"COUNTIF(Table2[28.8], 1)","v":14},{"$f":"COUNTIF(Table2[28.9], 1)","v":14},{"$f":"COUNTIF(Table2[30.1], 1)","v":10},{"$f":"COUNTIF(Table2[30.10], 1)","v":11},{"$f":"COUNTIF(Table2[30.11], 1)","v":19},{"$f":"COUNTIF(Table2[30.12], 1)","v":11},{"$f":"COUNTIF(Table2[30.13], 1)","v":10},{"$f":"COUNTIF(Table2[30.14], 1)","v":10},{"$f":"COUNTIF(Table2[30.15], 1)","v":10},{"$f":"COUNTIF(Table2[30.16], 1)","v":9},{"$f":"COUNTIF(Table2[30.2], 1)","v":10},{"$f":"COUNTIF(Table2[30.3], 1)","v":12},{"$f":"COUNTIF(Table2[30.4], 1)","v":12},{"$f":"COUNTIF(Table2[30.5], 1)","v":12},{"$f":"COUNTIF(Table2[30.6], 1)","v":11},{"$f":"COUNTIF(Table2[30.7], 1)","v":10},{"$f":"COUNTIF(Table2[30.8], 1)","v":11},{"$f":"COUNTIF(Table2[30.9], 1)","v":11},{"$f":"COUNTIF(Table2[31.1], 1)","v":9},{"$f":"COUNTIF(Table2[31.2], 1)","v":12},{"$f":"COUNTIF(Table2[32.1], 1)","v":16},{"$f":"COUNTIF(Table2[32.2], 1)","v":8},{"$f":"COUNTIF(Table2[36.1], 1)","v":10},{"$f":"COUNTIF(Table2[36.3], 1)","v":10},{"$f":"COUNTIF(Table2[38.1], 1)","v":8},{"$f":"COUNTIF(Table2[38.2], 1)","v":9},{"$f":"COUNTIF(Table2[42.1], 1)","v":9},{"$f":"COUNTIF(Table2[44.1], 1)","v":23},{"$f":"COUNTIF(Table2[52.1], 1)","v":10},{"$f":"COUNTIF(Table2[120.1], 1)","v":10},{"$f":"COUNTIF(Table2[120.2], 1)","v":9},{"$f":"COUNTIF(Table2[121.1], 1)","v":11},{"$f":"COUNTIF(Table2[123.1], 1)","v":11},{"$f":"COUNTIF(Table2[123.2], 1)","v":9},{"$f":"COUNTIF(Table2[130.1], 1)","v":11},{"$f":"COUNTIF(Table2[130.2], 1)","v":12},{"$f":"COUNTIF(Table2[130.3], 1)","v":10},{"$f":"COUNTIF(Table2[130.4], 1)","v":11},{"$f":"COUNTIF(Table2[131.1], 1)","v":12},{"$f":"COUNTIF(Table2[131.2], 1)","v":12},{"$f":"COUNTIF(Table2[131.3], 1)","v":11},{"$f":"COUNTIF(Table2[150.1], 1)","v":12},{"$f":"COUNTIF(Table2[150.2], 1)","v":10},{"$f":"COUNTIF(Table2[151.1], 1)","v":9},{"$f":"COUNTIF(Table2[151.2], 1)","v":10},{"$f":"COUNTIF(Table2[151.3], 1)","v":9},{"$f":"COUNTIF(Table2[151.4], 1)","v":11},{"$f":"COUNTIF(Table2[153.1], 1)","v":16},{"$f":"COUNTIF(Table2[153.2], 1)","v":12}]